program: Orca
programVersion: 5.0.4
elementType: S S H N N O O C C C C C O C C C N N C N C C N C C H H H H H H H H H H H
keywords: PBE0 ma-def2-TZVP AutoAux D4 VeryTightSCF TightOPT
charge: 0
multiplicity: 1
formula: C13H12N6O3S2
InChI: InChI=1/C13H12N6O3S2/c14-8-6(10(20)18-12(23)16-8)5(4-2-1-3-22-4)7-9(15)17-13(24)19-11(7)21/h1-3,5,16-19H,14-15H2
36 atoms
S  4.083726 -4.39193 -2.049221
S  -5.670896 -1.273161 -1.39846
H  -0.414325 3.130562 2.319884
N  1.111913 -0.479807 -2.025946
N  -1.935678 -3.131496 1.207415
O  0.976373 -3.503131 1.632734
O  -1.267235 0.857947 -1.288417
C  -0.050299 -1.015267 0.676545
C  1.458495 2.292033 1.428068
C  1.625006 0.988772 0.864208
C  0.175163 2.363933 1.843144
C  0.426797 0.368124 0.974149
O  -0.468517 1.193395 1.580323
C  -1.435374 -1.071168 0.074359
C  -1.91591 -0.093522 -0.821272
C  -2.276855 -2.116996 0.417052
N  -3.245908 -0.21196 -1.217031
N  -3.558525 -2.140345 -0.064439
C  -4.093865 -1.19695 -0.87218
N  2.434067 -2.335734 -1.863358
C  2.920516 -3.465331 -1.302068
C  1.481172 -1.525248 -1.299683
N  2.382651 -3.774328 -0.107765
C  0.980555 -1.841564 -0.04717
C  1.407239 -3.042204 0.561752
H  2.806341 -2.090545 -2.772074
H  -4.162752 -2.911689 0.188804
H  1.49535 -0.342657 -2.947587
H  0.355671 0.131671 -1.715476
H  -0.967646 -3.275007 1.48315
H  -2.594257 -3.874089 1.385894
H  2.697208 -4.624887 0.341013
H  -3.5924 0.502343 -1.844335
H  -0.134258 -1.487036 1.662445
H  2.20144 3.070685 1.508113
H  2.52069 0.573756 0.429771
totalener: -1852.18107251 hartree
nucrepener: 2369.70815468 hartree
electener: -4221.88922719 hartree
oneelecener: -7251.67345748 hartree
twoeener: 3029.78423029 hartree
cpcmener: -0.08267612 hartree
kineticenergy: 1845.52234640 hartree
exchangeener: -139.235951891607 hartree
correlationener: -6.572162367084 hartree
xcener: -145.808114258691 hartree
elementType: S H N O C
chargesum: -0.0000000
charge: -0.560978 -0.559108 0.202687 -0.534031 -0.581167 -0.668783 -0.627578 0.533581 -0.298529 0.125103 -0.026088 -0.467866 -0.317657 0.393511 0.348675 0.089302 -0.190167 -0.146277 0.203082 -0.153659 0.176098 0.465629 -0.221204 -0.625977 0.247663 0.324691 0.323031 0.329904 0.332733 0.320164 0.332127 0.320670 0.322363 0.199098 0.187512 0.201444
charge: 0.147668 0.146919 0.188466 0.029584 0.024135 -0.106729 -0.083382 -0.154406 -0.195639 -0.168179 -0.231598 -0.245319 0.222807 -0.122759 -0.374941 -0.249568 0.131017 0.134710 -0.612514 0.133001 -0.612584 -0.258970 0.128647 -0.129766 -0.377976 0.269257 0.269258 0.233753 0.231299 0.227130 0.233360 0.267517 0.268130 0.248208 0.186506 0.202956
qa: -0.5610 -0.5591 0.2027 -0.5340 -0.5812 -0.6688 -0.6276 0.5336 -0.2985 0.1251 -0.0261 -0.4679 -0.3177 0.3935 0.3487 0.0893 -0.1902 -0.1463 0.2031 -0.1537 0.1761 0.4656 -0.2212 -0.6260 0.2477 0.3247 0.3230 0.3299 0.3327 0.3202 0.3321 0.3207 0.3224 0.1991 0.1875 0.2014
va: 1.6569 1.6602 0.9587 3.0200 3.1429 1.7295 1.7418 2.3008 4.2124 3.6191 3.7739 4.4976 2.2963 2.4949 3.9727 4.3771 3.2626 3.1904 4.0117 3.1973 4.0717 3.6846 3.2629 3.7525 4.0396 0.9033 0.9034 0.9082 0.9183 0.9239 0.9059 0.9057 0.9036 0.9334 0.9631 0.9545
energy: -1852.333397065394
dipole: 3.11906 -3.00225 0.11682 4.97205 -5.14944 -0.17739 3.44629 -3.55374 -0.10745
magnitude: 0.23803 au
magnitude: 0.60503 debye
