program: Orca
programVersion: 5.0.4
elementType: S S H N N O O C C C C C O C C C N N C N C C N C C H H H H H H H H H H H
keywords: PBE0 ma-def2-TZVP AutoAux D4 VeryTightSCF TightOPT
charge: 0
multiplicity: 1
formula: C13H12N6O3S2
InChI: InChI=1/C13H12N6O3S2/c14-8-6(10(20)18-12(23)16-8)5(4-2-1-3-22-4)7-9(15)17-13(24)19-11(7)21/h1-3,5,16-19H,14-15H2
36 atoms
S  4.142183 -4.376814 -2.053665
S  -5.710295 -1.238941 -1.306228
H  -0.49077 3.101793 2.283852
N  1.228425 -0.413095 -1.99916
N  -1.963415 -3.078916 1.309605
O  0.870368 -3.592248 1.50789
O  -1.237876 0.750964 -1.410137
C  -0.040581 -1.030165 0.645246
C  1.415303 2.291988 1.439145
C  1.611446 0.994009 0.874953
C  0.119246 2.342322 1.820545
C  0.41533 0.360584 0.952796
O  -0.497748 1.170296 1.537835
C  -1.433178 -1.094229 0.062442
C  -1.899776 -0.146533 -0.879545
C  -2.295544 -2.095219 0.47303
N  -3.246667 -0.246624 -1.235331
N  -3.589647 -2.100528 0.022273
C  -4.115117 -1.183611 -0.820073
N  2.512783 -2.302966 -1.856443
C  2.956386 -3.460985 -1.32051
C  1.547854 -1.497552 -1.304028
N  2.358351 -3.809123 -0.168182
C  0.994526 -1.847367 -0.083646
C  1.361093 -3.09039 0.48981
H  2.928074 -2.029521 -2.738003
H  -4.208492 -2.843302 0.321486
H  1.620886 -0.269712 -2.916576
H  0.413895 0.146892 -1.730533
H  -0.981719 -3.274909 1.507039
H  -2.634116 -3.802222 1.521385
H  2.636303 -4.684854 0.255401
H  -3.588835 0.44431 -1.890493
H  -0.111654 -1.510743 1.628039
H  2.145298 3.080826 1.540383
H  2.52335 0.593754 0.461738
totalener: -1852.28835492 hartree
nucrepener: 2401.64597556 hartree
electener: -4253.93433048 hartree
oneelecener: -7314.89334606 hartree
twoeener: 3060.95901558 hartree
cpcmener: -0.05983029 hartree
kineticenergy: 1846.43275761 hartree
exchangeener: -139.422175977631 hartree
correlationener: -6.600708334976 hartree
xcener: -146.022884312607 hartree
elementType: S H N O C
chargesum: -0.0000000
charge: -0.566186 -0.566782 0.200446 -0.516290 -0.564957 -0.595418 -0.562588 0.412903 -0.278062 0.069733 -0.055581 -0.323640 -0.295156 0.461738 0.266476 0.202403 -0.181319 -0.157900 0.194448 -0.161799 0.162165 0.445726 -0.207255 -0.762158 0.246788 0.323027 0.320951 0.326132 0.323583 0.311111 0.327877 0.316763 0.318266 0.180888 0.185802 0.197868
charge: 0.137953 0.135889 0.187353 0.018480 0.009440 -0.065120 -0.038562 -0.153624 -0.199684 -0.172129 -0.238107 -0.245633 0.243477 -0.122257 -0.376004 -0.255505 0.128276 0.130934 -0.612754 0.130017 -0.613024 -0.263495 0.126516 -0.129705 -0.381161 0.268306 0.268073 0.231594 0.229925 0.223495 0.230864 0.266005 0.266397 0.246947 0.185413 0.201410
qa: -0.5662 -0.5668 0.2004 -0.5163 -0.5650 -0.5954 -0.5626 0.4129 -0.2781 0.0697 -0.0556 -0.3236 -0.2952 0.4617 0.2665 0.2024 -0.1813 -0.1579 0.1944 -0.1618 0.1622 0.4457 -0.2073 -0.7622 0.2468 0.3230 0.3210 0.3261 0.3236 0.3111 0.3279 0.3168 0.3183 0.1809 0.1858 0.1979
va: 1.6485 1.6475 0.9587 2.9958 3.0869 1.8156 1.8446 2.3772 4.1790 3.7126 3.7968 4.4339 2.3213 2.0309 4.1314 4.1309 3.2137 3.1911 4.0240 3.1953 4.0932 3.7188 3.2166 3.7334 4.0246 0.9043 0.9048 0.9099 0.9411 0.9455 0.9094 0.9082 0.9063 0.9439 0.9637 0.9556
energy: -1852.341048455276
dipole: 3.16455 -2.98051 0.18404 5.14772 -5.05247 0.09525 3.67359 -3.51941 0.15418
magnitude: 0.25829 au
magnitude: 0.65652 debye
