program: Orca
programVersion: 5.0.4
elementType: S S H N N O O C C C C C O C C C N N C N C C N C C H H H H H H H
keywords: PBE0 ma-def2-TZVP AutoAux D4 VeryTightSCF TightOPT
charge: -4
multiplicity: 1
formula: C13H8N6O3S2
InChI: InChI=1/C13H8N6O3S2/c14-8-6(10(20)18-12(23)16-8)5(4-2-1-3-22-4)7-9(15)17-13(24)19-11(7)21/h1-3,5H,14-15H2
32 atoms
S  3.879343 -2.223116 -4.11275
S  -5.694688 0.562561 -0.559047
H  -0.071506 0.380962 4.436065
N  0.184347 -3.7326 -1.211625
N  -0.883137 1.531324 -0.005097
O  1.615126 0.810398 -0.980047
O  -2.339433 -2.999906 -0.043188
C  -0.075429 -1.309955 0.288657
C  1.775844 0.066751 3.210597
C  1.833232 -0.43153 1.872309
C  0.467627 0.083726 3.550142
C  0.554524 -0.676314 1.488846
O  -0.285659 -0.371099 2.516093
C  -1.473509 -0.80132 -0.004367
C  -2.538676 -1.733843 -0.116813
C  -1.821209 0.542099 -0.118659
N  -3.811509 -1.296822 -0.300694
N  -3.086945 0.958052 -0.299045
C  -4.04304 0.018885 -0.368205
N  1.845429 -2.897321 -2.548778
C  2.66709 -1.892914 -2.893979
C  0.974309 -2.662719 -1.554818
N  2.602051 -0.664609 -2.372711
C  0.879092 -1.443202 -0.88295
C  1.693392 -0.396591 -1.397094
H  0.19817 -4.471486 -1.898103
H  -0.735334 -3.530972 -0.810013
H  0.074492 1.28682 -0.292178
H  -1.210222 2.431187 -0.323502
H  -0.258081 -2.338346 0.622883
H  2.60208 0.378871 3.832219
H  2.714061 -0.574062 1.266763
totalener: -1850.32679162 hartree
nucrepener: 2289.53601503 hartree
electener: -4139.86280665 hartree
oneelecener: -7184.05218807 hartree
twoeener: 3044.18938143 hartree
cpcmener: -0.89742633 hartree
kineticenergy: 1844.39013554 hartree
exchangeener: -138.964751073594 hartree
correlationener: -6.583463495649 hartree
xcener: -145.548214569243 hartree
elementType: S H N O C
chargesum: -4.0000000
charge: -0.925623 -0.929695 0.194926 -0.631182 -0.551911 -0.830446 -0.872333 -0.640362 -0.238994 -0.119746 -0.115454 0.279303 -0.259634 0.647819 0.304528 -0.114413 -0.703311 -0.674802 0.409787 -0.673745 0.385292 0.147683 -0.672122 0.516496 0.393058 0.284190 0.304769 0.312307 0.276840 0.121021 0.180523 0.195233
charge: -0.201055 -0.201521 0.184964 -0.118362 -0.099889 -0.255753 -0.281670 -0.178102 -0.211003 -0.186887 -0.256002 -0.238974 0.213069 -0.164194 -0.452304 -0.349387 -0.081427 -0.075885 -0.687538 -0.078191 -0.687431 -0.348274 -0.077366 -0.164224 -0.455621 0.208495 0.204772 0.210879 0.208469 0.238844 0.182932 0.198637
qa: -0.9256 -0.9297 0.1949 -0.6312 -0.5519 -0.8304 -0.8723 -0.6404 -0.2390 -0.1197 -0.1155 0.2793 -0.2596 0.6478 0.3045 -0.1144 -0.7033 -0.6748 0.4098 -0.6737 0.3853 0.1477 -0.6721 0.5165 0.3931 0.2842 0.3048 0.3123 0.2768 0.1210 0.1805 0.1952
va: 1.1171 1.1161 0.9609 2.9015 2.8410 1.4659 1.4209 3.2680 4.1659 4.0174 3.8183 3.6689 2.1243 2.0331 3.8982 4.4606 2.7111 2.6310 3.6435 2.6515 3.6518 4.0044 2.7177 0.7569 3.8973 0.9370 0.9309 0.9388 0.9409 0.9886 0.9634 0.9536
energy: -1850.380820874701
dipole: 5.30925 -2.35177 2.95748 0.49268 -0.01116 0.48152 10.21668 -3.14244 7.07424
magnitude: 7.68267 au
magnitude: 19.52779 debye
