program: Gaussian 09
title: 000050510
version: EM64L-G09RevD.01
frameworkgroup: C1[X(C19H17Br2NO3)]
method: RPBEPBE
basis: SDD
operation: Freq
keyword: #p
keyword: freq=noraman
keyword: PBEPBE/SDD
title: #p freq=noraman PBEPBE/SDD
converged: YES YES NO NO
title: Mulliken charges:
elementType: Br Br O O O N C C C C C C C C C C C C C C C C C C C H H H H H H H H H H H H H H H H H
charge: 0.027156 0.075820 -0.245359 -0.199320 -0.413468 -0.123520 -0.453169 -0.347937 -0.343140 0.341905 -0.322580 -0.318711 0.264129 -0.524364 0.220957 0.167509 -0.649324 0.352313 -0.329200 0.309210 -0.385803 -0.384012 -0.222960 -0.226877 -0.240319 0.230886 0.238239 0.226418 0.203533 0.193330 0.212427 0.217078 0.192445 0.192610 0.214777 0.307034 0.352243 0.253166 0.247997 0.228784 0.228966 0.231134
chargesum: 0.00000
title: Mulliken charges with hydrogens summed into heavy atoms:
elementType: Br Br O O O N C C C C C C C C C C C C C C C C C C C
charge: 0.027156 0.075820 -0.245359 -0.199320 -0.061225 -0.123520 0.015955 0.082014 0.062617 0.341905 0.086943 0.088676 0.264129 -0.217330 0.220957 0.167509 -0.649324 0.352313 -0.329200 0.309210 -0.132638 -0.136016 0.005825 0.002089 -0.009185
polarizability: 3.60964032e+02 1.41588661e+00 2.66712323e+02 2.07171450e+01 8.50549122e+00 1.60618493e+02
1716.lowfreq: -14.0419 -2.7955 -0.0005 -0.0002 0.0003 2.4845 11.4825 25.8104 35.3048
frequency: 0.7791 25.7440 35.2700 37.9561 43.2488 56.1182 75.6786 97.9002 104.2762 128.5754 140.1819 160.9598 190.8476 208.9621 220.8384 237.3549 249.7189 275.3564 288.9587 300.0539 315.9179 352.4254 362.6800 394.6651 404.4215 411.3635 436.2676 455.8172 462.3814 467.9208 494.6787 500.3768 542.2815 572.9936 602.2343 605.4899 623.8729 651.4381 668.9576 680.8003 704.7985 734.6134 760.4300 775.4542 784.0611 806.9138 815.6190 841.3754 853.8476 885.6438 906.7608 918.6765 926.4979 937.2317 977.7926 986.9243 989.1854 997.4886 1000.6533 1026.8920 1027.8450 1052.5582 1056.5222 1077.5112 1082.4578 1087.2091 1104.2629 1126.3333 1132.6039 1144.2439 1153.2371 1173.3837 1189.3356 1189.7819 1214.3183 1224.2947 1260.6793 1272.5383 1285.3387 1293.8794 1309.3751 1318.5096 1332.3950 1342.3356 1357.1910 1370.7653 1372.0854 1382.0412 1390.3568 1417.9895 1432.2915 1443.3745 1445.7549 1450.2231 1452.4737 1462.9422 1473.0226 1475.1318 1556.4393 1563.9773 1585.5083 1617.4172 1625.7277 2870.0546 2878.1762 2908.9637 2950.8421 2955.1618 2996.2713 3026.4295 3036.8440 3081.8129 3085.2123 3125.8168 3132.2930 3144.0511 3153.1446 3166.9691 3172.6596 3463.3497
redmass: 5.6436 5.4897 5.8557 3.6054 5.3912 5.7090 8.6488 8.9691 8.2386 7.4580 5.4573 5.5617 7.5424 8.7506 5.9585 2.4377 3.7585 4.7802 5.2056 5.0912 2.1733 6.8373 6.7740 2.0035 2.8555 5.9154 6.2250 1.1389 5.2284 2.8939 8.3469 5.5305 4.5476 3.8426 2.8022 7.0508 7.0570 3.8660 6.5786 6.7174 1.7588 6.8274 2.8994 4.1612 3.8284 3.8824 5.8013 1.6072 1.2447 2.3435 3.7088 1.3949 1.8812 4.3045 1.3856 1.9075 6.2351 1.3180 2.7083 2.3882 2.1656 2.0028 5.4443 2.5623 2.6676 3.4149 2.2077 1.9288 2.6507 2.6528 3.2736 1.0533 1.1136 1.0683 1.4023 1.2959 2.6831 1.5328 1.5496 1.2797 2.2173 1.7960 1.3886 1.3521 1.4407 1.2745 6.5503 1.6098 5.1402 4.5396 2.2840 1.0824 1.2107 1.1068 1.3940 1.3373 1.6167 2.3873 8.7782 8.8038 6.1141 6.4265 9.0510 1.0700 1.0692 1.0675 1.0670 1.0669 1.0904 1.0900 1.0901 1.0958 1.0973 1.0846 1.0878 1.0927 1.0970 1.1018 1.0927 1.0644
irintensity: 0.0956 0.3401 0.0874 0.0903 0.0960 0.3003 0.6573 0.8782 0.7409 2.1044 0.6289 2.1752 0.4375 0.5736 0.1157 2.4542 0.8552 3.6036 0.0996 7.4061 13.3811 3.3386 4.1807 0.5566 0.0517 3.7437 8.6605 115.6715 3.5595 0.5552 1.3030 3.3793 0.7847 6.4190 6.8039 0.3356 2.5241 64.9306 8.1653 4.1064 56.3669 0.7362 47.0187 1.4493 7.0414 21.2143 45.8193 1.1932 0.1461 15.5972 6.7416 25.3259 5.6254 13.9896 0.2585 0.9031 0.8312 0.2342 35.9905 8.2333 14.3924 21.6873 29.6503 77.0274 90.4697 46.0748 1.6870 76.1831 81.7053 3.0541 39.3590 0.0014 0.7136 1.5749 92.2024 44.2423 36.1644 17.8831 36.4977 0.0647 73.4837 50.0538 15.5951 20.5252 6.5962 4.2702 3.1393 10.3348 130.3137 5.2351 10.0488 2.6773 4.2909 11.6743 11.7530 8.6593 6.9656 7.2984 10.6671 10.9570 1.8884 5.6894 11.7899 56.5524 110.3717 44.9639 27.6520 96.4007 13.0923 46.0922 32.9666 42.2057 39.8360 1.7654 0.7334 22.6606 32.4392 19.2499 4.8851 49.8337
temp: 298.150 k
press: 1.00000 atm
elementType: 35 35 8 8 8 7 6 6 6 6 6 6 6 6 6 6 6 6 6 6 6 6 6 6 6 1 1 1 1 1 1 1 1 1 1 1 1 1 1 1 1 1
symmnumber: 1
zpe: 831346.8 jmol-1
zpe.correction: 0.316643 hartree
zpe.thermalcorrener: 0.339393 hartree
zpe.thermalcorrenthalpy: 0.340338 hartree
zpe.thermalcorrgfe: 0.257990 hartree
zpe.sumelectzpe: -1039.719444 hartree
zpe.sumelectthermal: -1039.696694 hartree
zpe.sumelectthermalent: -1039.695750 hartree
zpe.sumelectthermalfe: -1039.778098 hartree
dipole: 1.7034 -1.9495 -0.4668
dipole: 2.6307
quadrupole: -163.3466 -163.0354 -158.9147
quadrupole: 1.5318 9.9979 3.2201
quadrupole: -1.5811 -1.2698 2.8509 1.5318 9.9979 3.2201
hfenergy: -1040.0360874 hartree
pointgroup: C01 [X(C19H17Br2N1O3)]
dipole: -0.6997428 0.7163122 -0.2616035 debye
polarizability: 360.3736097|2.2754498|263.4364553|-22.4664025|-21.1294835|164.4847829 unknown
InChI: InChI=1S/C19H17Br2NO3/c20-17-16-14(25-19(21)15(16)12-4-2-1-3-5-12)10-13(18(17)23)11-22-6-8-24-9-7-22/h1-5,10,23H,6-9,11H2
charge 0 multiplicity 1
42 atoms
Br -1.900247 2.899345 -0.016535
Br -2.887928 -3.617096 0.344161
O  6.599518 -0.979987 0.937334
O  -0.481322 -2.20441 0.026369
O  1.188212 3.085897 -0.46236
N  4.17848 0.125621 -0.223182
C  3.215493 1.172131 -0.631139
C  4.374991 0.077277 1.250745
C  5.486353 0.239738 -0.918233
C  1.765016 0.754376 -0.409156
C  5.298793 -1.094184 1.619067
C  6.390352 -0.938516 -0.519539
C  -1.007119 0.060939 -0.076623
C  1.402054 -0.601211 -0.295755
C  0.047508 -0.899529 -0.13164
C  0.749359 1.761186 -0.34464
C  -0.614774 1.418902 -0.170773
C  -2.257203 -0.68669 0.109838
C  -1.868078 -2.017197 0.172464
C  -3.654323 -0.189243 0.19125
C  -4.249276 0.477211 -0.912385
C  -4.427758 -0.403948 1.361875
C  -5.585778 0.925525 -0.843105
C  -5.76546 0.043466 1.430407
C  -6.34847 0.711176 0.328864
H  3.362832 1.372598 -1.711528
H  3.396539 2.143592 -0.115099
H  3.393147 -0.054458 1.742006
H  4.82181 1.031578 1.626357
H  6.007134 1.197415 -0.666348
H  5.316753 0.218887 -2.011674
H  5.52986 -1.095879 2.696902
H  4.813211 -2.05452 1.339951
H  5.928308 -1.891111 -0.858619
H  7.396005 -0.835473 -0.959498
H  2.181397 -1.365993 -0.338707
H  0.415745 3.7081 -0.376429
H  -3.664076 0.637751 -1.824367
H  -3.975037 -0.91388 2.21956
H  -6.03255 1.436246 -1.703362
H  -6.349089 -0.12584 2.342029
H  -7.386182 1.058905 0.381718
