program: Orca
programVersion: 5.0.4
elementType: S S N N O O C C C S C C C C C N N C N C C N C C H H H H H H H H
keywords: PBE0 aug-cc-pVDZ AutoAux D4 VeryTightSCF
charge: -4
multiplicity: 1
formula: C13H8N6O2S3
InChI: InChI=1/C13H8N6O2S3/c14-8-6(10(20)18-12(22)16-8)5(4-1-2-24-3-4)7-9(15)17-13(23)19-11(7)21/h1-3,5H,14-15H2
32 atoms
S  4.130337 -2.122235 -3.828715
S  -5.900892 0.438218 -0.535995
N  0.185749 -3.681109 -1.243853
N  -1.068416 1.531384 -0.204604
O  1.630792 0.829706 -0.715935
O  -2.393444 -3.041219 -0.038207
C  -0.188951 -1.267832 0.276679
C  2.006297 -0.143439 3.127556
C  1.75181 -0.665882 1.898008
S  0.563515 0.451954 3.850462
C  0.373965 -0.622892 1.523932
C  -0.377891 -0.031077 2.495998
C  -1.605578 -0.815486 -0.039212
C  -2.651814 -1.797766 -0.113235
C  -1.990898 0.504183 -0.237421
N  -3.946838 -1.38189 -0.260123
N  -3.267632 0.887772 -0.424793
C  -4.198192 -0.081484 -0.39226
N  1.946413 -2.808788 -2.447131
C  2.801142 -1.797027 -2.68291
C  1.000828 -2.587617 -1.51914
N  2.72654 -0.590944 -2.126511
C  0.84408 -1.387779 -0.836055
C  1.731869 -0.330744 -1.221832
H  0.218288 -4.331918 -2.012991
H  -0.759536 -3.479875 -0.891809
H  -0.084788 1.294783 -0.405956
H  -1.427298 2.349942 -0.669131
H  -0.357913 -2.302505 0.60777
H  2.960374 -0.028742 3.623874
H  2.508185 -1.058813 1.230395
H  -1.438721 0.166261 2.453714
totalener: -2172.14756437 hartree
nucrepener: 2416.48117561 hartree
electener: -4588.62873998 hartree
oneelecener: -7878.89800048 hartree
twoeener: 3290.26926050 hartree
kineticenergy: 2165.10972967 hartree
exchangeener: -151.270334401555 hartree
correlationener: -6.923945947330 hartree
xcener: -158.194280348885 hartree
chargesum: -4.0000000
charge: -0.882175 -0.876401 -0.154531 -0.132830 -1.087646 -1.047993 0.671582 -0.474220 1.180863 -0.204652 0.972678 0.150994 0.951815 0.464895 0.011480 -0.598297 -0.618794 0.067117 -0.609095 0.114978 -0.038724 -0.629860 1.198916 0.563286 -0.097459 -0.085274 -0.063571 -0.121147 -0.423411 -0.634783 -0.755185 -0.812555
charge: -0.069481 -0.073443 0.259674 0.270239 0.001494 -0.028758 -0.115474 -0.361631 -0.055578 0.836075 -0.240073 -0.258655 -0.094892 -0.478550 -0.359930 -0.017777 -0.013868 -0.867269 -0.014864 -0.866699 -0.346678 -0.013531 -0.089928 -0.486675 -0.070058 -0.131532 -0.133055 -0.066133 0.010968 -0.090622 0.006825 -0.040119
qa: -0.8822 -0.8764 -0.1545 -0.1328 -1.0876 -1.0480 0.6716 -0.4742 1.1809 -0.2047 0.9727 0.1510 0.9518 0.4649 0.0115 -0.5983 -0.6188 0.0671 -0.6091 0.1150 -0.0387 -0.6299 1.1989 0.5633 -0.0975 -0.0853 -0.0636 -0.1211 -0.4234 -0.6348 -0.7552 -0.8126
va: 0.7818 0.7722 2.7107 2.7869 1.3409 1.2145 2.4792 2.9413 -0.4972 1.1955 2.9861 -0.2918 2.3695 1.0785 1.1345 1.9893 2.1336 2.9025 2.1675 2.8672 -0.3133 1.9554 1.1358 1.6151 1.0012 1.0724 0.9831 1.0055 0.7839 0.6953 0.2041 0.4529
energy: 1521.9 3869.7 4093.9 4202.2 8240.9 8968.8 9452.6 11655.2 11842.9 12033.9 12445.3 12794.7 13006.3 13753.2 13886.0 14292.1 14591.6 14892.5 15648.8 15785.0 15981.3 16083.7 16300.1 16768.7 17048.5 17083.7 17112.7 17221.0 17522.7 17609.1 17954.2 18047.8 18082.7 18606.5 18783.9 19043.1 19569.6 19730.5 20285.7 20455.9 20704.3 20854.7 20882.3 20998.7 21178.4 21397.9 21440.3 21548.2 21636.9 21678.6 21961.3 22098.2 22135.2 22280.9 22333.3 22359.5 22412.9 22516.0 22668.6 22706.2 22777.9 22874.9 23115.0 23191.1 23218.3 23324.7 24077.7 24112.1 24341.6 24510.6 24586.0 24882.9 24925.0 24968.0 24988.9 25037.1 25115.1 25206.5 25295.2 25426.2 25474.7 25491.5 25731.8 25845.5 25895.0 26019.2 26031.6 26084.8 26165.4 26178.0 26372.8 26410.0 26509.9 26636.8 26870.8 27078.2 27165.2 27304.2 27460.8 27542.0 27602.3 27663.4 27704.4 27802.5 28029.9 28120.0 28151.1 28182.5 28198.1 28333.8 28423.3 28473.4 28677.0 28703.5 28977.4 29018.5 29087.4 29114.8 29267.1 29336.5 29377.3 29413.5 29527.5 29620.0 29650.8 29694.3 29771.2 29871.6 30057.8 30060.2 30105.9 30193.8 30217.8 30275.3 30311.0 30323.1 30391.9 30463.3 30471.6 30626.9 30642.2 30678.7 30709.3 30837.1 31036.9 31097.9 31135.5 31278.2 31327.1 31366.5 31489.0 31565.2 31631.4 31724.5 31755.9 31835.0 31858.2 31885.3 31964.9 31973.2 32033.1 32154.8 32182.8 32201.6 32334.8 32406.5 32544.3 32637.8 32743.8 32836.0 32860.3 32960.9 33085.9 33127.3 33149.2 33404.0 33447.1 33617.6 33632.2 33786.8 33888.7 33912.3 33952.7 33994.1 34130.3 34169.9 34215.7 34272.7 34385.3 34480.2 34620.1 34662.1 34713.4 34860.2 34962.1 35003.0 35100.5 35136.8 35302.2 35378.9
energy: -2172.197669201222
dipole: 3.57586 -1.18204 2.39382 -1.01385 1.67072 0.65687 5.47075 0.83775 6.30849
magnitude: 6.77930 au
magnitude: 17.23161 debye
