program: Orca
programVersion: 5.0.4
elementType: S S N N O O C C C S C C C C C N N C N C C N C C H H H H H H H H
keywords: PBE0 ma-def2-TZVP AutoAux D4 VeryTightSCF TightOPT
charge: -4
multiplicity: 1
formula: C13H8N6O2S3
InChI: InChI=1/C13H8N6O2S3/c14-8-6(10(20)18-12(22)16-8)5(4-1-2-24-3-4)7-9(15)17-13(23)19-11(7)21/h1-3,5H,14-15H2
32 atoms
S  3.761999 -1.863534 -4.115017
S  -5.768739 0.18915 -0.941557
N  0.037431 -3.516899 -1.340368
N  -1.016562 1.417044 -0.470908
O  1.737544 0.861834 -0.55337
O  -2.331793 -3.075441 0.376483
C  -0.125146 -1.273043 0.397553
C  1.997959 -0.249854 3.318495
C  1.739484 -0.868164 2.134072
S  0.646566 0.650718 3.85149
C  0.426599 -0.615056 1.637714
C  -0.274718 0.19405 2.483222
C  -1.539698 -0.874028 0.04438
C  -2.572188 -1.845746 0.079564
C  -1.916346 0.401159 -0.373123
N  -3.851971 -1.500076 -0.21664
N  -3.185659 0.726132 -0.684455
C  -4.113559 -0.237913 -0.577036
N  1.721882 -2.618219 -2.603454
C  2.596647 -1.62498 -2.833913
C  0.871658 -2.456085 -1.576482
N  2.621272 -0.474045 -2.152847
C  0.842898 -1.319147 -0.769605
C  1.734119 -0.280945 -1.140384
H  -0.018862 -4.183005 -2.093395
H  -0.811129 -3.376753 -0.79578
H  -0.012923 1.215462 -0.460328
H  -1.327471 2.223581 -0.986196
H  -0.22734 -2.317619 0.711754
H  2.906159 -0.273604 3.903838
H  2.461534 -1.487569 1.615676
H  -1.288267 0.549734 2.371186
totalener: -2173.17615430 hartree
nucrepener: 2412.72133062 hartree
electener: -4585.89748492 hartree
oneelecener: -7879.05846540 hartree
twoeener: 3293.16098048 hartree
cpcmener: -0.91340573 hartree
kineticenergy: 2166.27291452 hartree
exchangeener: -151.336071376623 hartree
correlationener: -6.922222509808 hartree
xcener: -158.258293886431 hartree
elementType: S N O C H
chargesum: -4.0000000
charge: -0.925488 -0.929226 -0.659114 -0.611986 -0.828518 -0.885869 -0.952818 -0.135170 -0.273146 -0.029691 0.348824 -0.227816 0.485471 0.258178 0.141337 -0.707023 -0.679258 0.436242 -0.681511 0.452987 -0.057034 -0.677540 0.922133 0.285947 0.291175 0.291738 0.298245 0.288312 0.135139 0.211741 0.191364 0.222374
charge: -0.199264 -0.199775 -0.101756 -0.091068 -0.266442 -0.297119 -0.189256 -0.436085 -0.215541 0.679142 -0.238164 -0.412781 -0.178708 -0.460865 -0.356140 -0.086065 -0.078208 -0.690075 -0.077589 -0.688847 -0.347254 -0.080410 -0.173658 -0.460306 0.210361 0.207722 0.212469 0.210317 0.234594 0.175348 0.201098 0.194322
qa: -0.9255 -0.9292 -0.6591 -0.6120 -0.8285 -0.8859 -0.9528 -0.1352 -0.2731 -0.0297 0.3488 -0.2278 0.4855 0.2582 0.1413 -0.7070 -0.6793 0.4362 -0.6815 0.4530 -0.0570 -0.6775 0.9221 0.2859 0.2912 0.2917 0.2982 0.2883 0.1351 0.2117 0.1914 0.2224
va: 1.1193 1.1175 2.9728 2.8102 1.4230 1.4269 3.2535 4.0739 4.0652 2.6052 3.3411 4.0985 1.4793 3.9576 4.1672 2.6784 2.6144 3.5821 2.6103 3.5444 4.2678 2.7003 1.2191 4.0127 0.9325 0.9361 0.9435 0.9333 0.9718 0.9433 0.9527 0.9363
energy: -2173.308416586604
dipole: 3.71198 -0.57386 3.13812 -1.40495 2.39979 0.99484 6.13761 1.96636 8.10397
magnitude: 8.74710 au
magnitude: 22.23336 debye
