program: Orca
programVersion: 5.0.4
elementType: S S N N O O C C C S C C C C C N N C N C C N C C H H H H H H H H H H H H H H
keywords: PBE0 ma-def2-TZVP AutoAux D4 VeryTightSCF TightOPT
charge: 2
multiplicity: 1
formula: C13H14N6O2S3
InChI: InChI=1/C13H14N6O2S3/c14-8-6(10(20)18-12(22)16-8)5(4-1-2-24-3-4)7-9(15)17-13(23)19-11(7)21/h1-3,5,16-19H,14-15H3
38 atoms
S  3.643314 -1.85842 -4.136782
S  -5.626443 0.49052 -1.288294
N  0.312836 -3.85579 -0.989621
N  -1.032514 1.538698 0.347116
O  1.175288 0.847733 -0.906065
O  -2.215326 -2.970537 -0.726035
C  -0.198851 -1.366173 0.430646
C  2.090136 -0.071981 3.108977
C  1.80617 -0.574997 1.875221
S  0.672429 0.22108 4.005138
C  0.411171 -0.721553 1.654009
C  -0.32485 -0.328383 2.73908
C  -1.525884 -0.814706 -0.024416
C  -2.465775 -1.776345 -0.560398
C  -1.919798 0.475596 -0.035491
N  -3.699189 -1.293925 -0.908075
N  -3.1543 0.864127 -0.424883
C  -4.112795 -0.000101 -0.856301
N  1.854838 -2.758762 -2.405242
C  2.559322 -1.705124 -2.904738
C  0.997333 -2.645607 -1.369096
N  2.272805 -0.521387 -2.300228
C  0.744793 -1.481015 -0.73574
C  1.38144 -0.306142 -1.28216
H  0.380069 -4.585742 -1.70607
H  -0.714662 -3.625534 -0.835952
H  -0.066374 1.323266 -0.062362
H  -1.341427 2.450995 -0.006469
H  -0.433542 -2.381549 0.759097
H  3.061185 0.145198 3.530897
H  2.573723 -0.839428 1.159363
H  2.738464 0.299892 -2.671944
H  2.007136 -3.663004 -2.841894
H  -3.410526 1.846305 -0.38684
H  -4.368852 -1.969893 -1.26029
H  -0.945988 1.608922 1.369593
H  0.697023 -4.2491 -0.120349
H  -1.398499 -0.363372 2.867054
totalener: -2176.03453367 hartree
nucrepener: 2600.03077999 hartree
electener: -4776.06531366 hartree
oneelecener: -8105.89433515 hartree
twoeener: 3329.82902149 hartree
cpcmener: -0.37231894 hartree
kineticenergy: 2169.66012324 hartree
exchangeener: -152.051812820011 hartree
correlationener: -6.954752781654 hartree
xcener: -159.006565601665 hartree
elementType: S N O C H
chargesum: 2.0000000
charge: -0.464507 -0.470062 -0.389721 -0.322571 -0.429662 -0.480088 -1.018832 -0.079704 -0.369422 0.056916 -0.033027 -0.141774 0.621109 0.049348 -0.116116 -0.156869 -0.159682 0.151656 -0.120762 0.178159 -0.145795 -0.151802 1.056127 0.344955 0.388756 0.352545 0.353035 0.388213 0.250351 0.224841 0.216258 0.334203 0.346457 0.346272 0.332909 0.402243 0.410200 0.245844
charge: 0.239865 0.235440 0.177678 0.166743 0.011872 -0.003107 -0.142973 -0.401482 -0.196573 0.741926 -0.240844 -0.394995 -0.079359 -0.328172 -0.190177 0.159568 0.156205 -0.595283 0.158130 -0.594191 -0.179071 0.159922 -0.083072 -0.336760 0.272138 0.248406 0.247875 0.272088 0.251293 0.182915 0.210562 0.278549 0.280819 0.280812 0.277791 0.272223 0.280592 0.202648
qa: -0.4645 -0.4701 -0.3897 -0.3226 -0.4297 -0.4801 -1.0188 -0.0797 -0.3694 0.0569 -0.0330 -0.1418 0.6211 0.0493 -0.1161 -0.1569 -0.1597 0.1517 -0.1208 0.1782 -0.1458 -0.1518 1.0561 0.3450 0.3888 0.3525 0.3530 0.3882 0.2504 0.2248 0.2163 0.3342 0.3465 0.3463 0.3329 0.4022 0.4102 0.2458
va: 1.7855 1.7824 3.4272 3.3461 1.9223 1.9497 5.4025 4.0376 4.7382 2.7299 4.9417 3.9341 3.5535 4.2614 4.5714 3.2947 3.2988 4.1041 3.2175 4.0292 4.4790 3.3247 0.6168 4.0968 0.8571 0.9371 0.9437 0.8574 0.9000 0.9386 0.9433 0.8964 0.8855 0.8874 0.8973 0.8316 0.8283 0.9291
energy: -2176.090053377195
dipole: 2.79369 -2.43167 0.36202 -2.70765 0.81687 -1.89079 4.61731 -3.49177 1.12554
magnitude: 2.23001 au
magnitude: 5.66824 debye
