program: Orca
programVersion: 5.0.4
elementType: S S N N O O C C C S C C C C C N N C N C C N C C H H H H H H H H H H H H H H
keywords: PBE0 ma-def2-TZVP AutoAux D4 VeryTightSCF TightOPT
charge: 2
multiplicity: 1
formula: C13H14N6O2S3
InChI: InChI=1/C13H14N6O2S3/c14-8-6(10(20)18-12(22)16-8)5(4-1-2-24-3-4)7-9(15)17-13(23)19-11(7)21/h1-3,5,16-19H,14-15H3
38 atoms
S  3.635547 -1.851363 -4.147784
S  -5.633111 0.481055 -1.268679
N  0.314339 -3.855048 -1.001798
N  -1.035562 1.543558 0.330528
O  1.211506 0.842151 -0.873376
O  -2.221271 -2.977141 -0.704539
C  -0.196751 -1.367518 0.428365
C  2.084419 -0.081657 3.11583
C  1.803974 -0.593498 1.885017
S  0.662726 0.244932 3.994557
C  0.408907 -0.720213 1.651725
C  -0.331093 -0.302616 2.724462
C  -1.524086 -0.817042 -0.026709
C  -2.468855 -1.780371 -0.547631
C  -1.917243 0.472505 -0.0433
N  -3.706224 -1.301671 -0.888783
N  -3.155721 0.859722 -0.427123
C  -4.117412 -0.007568 -0.844271
N  1.850025 -2.75425 -2.416972
C  2.561427 -1.70135 -2.907652
C  0.994558 -2.642187 -1.377448
N  2.292552 -0.522034 -2.287586
C  0.750261 -1.481434 -0.735785
C  1.40163 -0.309813 -1.267435
H  0.399439 -4.588462 -1.711324
H  -0.71627 -3.630615 -0.858039
H  -0.066734 1.332311 -0.072578
H  -1.350373 2.449237 -0.032416
H  -0.434281 -2.382665 0.756099
H  3.054395 0.124728 3.544781
H  2.572641 -0.875295 1.177069
H  2.766104 0.300518 -2.646718
H  1.989632 -3.654263 -2.865504
H  -3.410276 1.842228 -0.399399
H  -4.376834 -1.985473 -1.223354
H  -0.95287 1.617518 1.352587
H  0.691746 -4.230036 -0.122175
H  -1.406978 -0.313122 2.837818
totalener: -2175.94460015 hartree
nucrepener: 2599.26653635 hartree
electener: -4775.21113650 hartree
oneelecener: -8104.15063992 hartree
twoeener: 3328.93950342 hartree
cpcmener: -0.38103551 hartree
kineticenergy: 2169.58315179 hartree
exchangeener: -152.023836854554 hartree
correlationener: -6.953021982537 hartree
xcener: -158.976858837092 hartree
elementType: S N O C H
chargesum: 2.0000000
charge: -0.474293 -0.479745 -0.413155 -0.336735 -0.480968 -0.531279 -1.251490 -0.086261 -0.390891 0.050140 0.078345 -0.155191 0.641455 0.076072 -0.091734 -0.174462 -0.156970 0.160182 -0.110597 0.189202 -0.095001 -0.164737 1.191668 0.360664 0.384848 0.385907 0.381614 0.384320 0.250558 0.224460 0.215330 0.335916 0.345900 0.345898 0.334196 0.400493 0.407806 0.248536
charge: 0.234417 0.229988 0.180839 0.169805 -0.000412 -0.012932 -0.139936 -0.402650 -0.196699 0.738817 -0.239438 -0.396299 -0.076244 -0.321894 -0.187634 0.159984 0.154935 -0.597041 0.157499 -0.595533 -0.176734 0.160420 -0.081078 -0.331478 0.270647 0.255290 0.253486 0.271202 0.253483 0.182522 0.210737 0.279170 0.280210 0.280126 0.278200 0.271390 0.280015 0.202821
qa: -0.4743 -0.4797 -0.4132 -0.3367 -0.4810 -0.5313 -1.2515 -0.0863 -0.3909 0.0501 0.0783 -0.1552 0.6415 0.0761 -0.0917 -0.1745 -0.1570 0.1602 -0.1106 0.1892 -0.0950 -0.1647 1.1917 0.3607 0.3848 0.3859 0.3816 0.3843 0.2506 0.2245 0.2153 0.3359 0.3459 0.3459 0.3342 0.4005 0.4078 0.2485
va: 1.7741 1.7713 3.4722 3.3772 1.8656 1.8952 5.0832 4.0436 4.7583 2.7259 4.6041 3.9519 3.5544 4.2180 4.5299 3.3288 3.2811 4.0927 3.1936 4.0106 4.4151 3.3471 0.1567 4.1008 0.8602 0.8976 0.9090 0.8605 0.8991 0.9387 0.9451 0.8952 0.8858 0.8876 0.8963 0.8318 0.8291 0.9273
energy: -2176.081706982725
dipole: 2.78278 -2.44481 0.33797 -2.70865 0.78884 -1.91981 4.53783 -3.48895 1.04888
magnitude: 2.21361 au
magnitude: 5.62654 debye
