program: Orca
programVersion: 5.0.4
elementType: S S N N O O C C C S C C C C C N N C N C C N C C H H H H H H H H H H H H H H
keywords: PBE0 aug-cc-pVDZ AutoAux D4 VeryTightSCF
charge: 2
multiplicity: 1
formula: C13H14N6O2S3
InChI: InChI=1/C13H14N6O2S3/c14-8-6(10(20)18-12(22)16-8)5(4-1-2-24-3-4)7-9(15)17-13(23)19-11(7)21/h1-3,5,16-19H,14-15H3
38 atoms
S  3.648985 -1.855009 -4.137231
S  -5.632745 0.479895 -1.274038
N  0.306402 -3.856529 -1.012015
N  -1.034639 1.544453 0.327714
O  1.212518 0.838325 -0.870522
O  -2.222665 -2.978224 -0.690377
C  -0.196331 -1.368011 0.430568
C  2.083649 -0.069125 3.115275
C  1.804751 -0.581227 1.884157
S  0.661727 0.243558 3.998399
C  0.410187 -0.719367 1.65358
C  -0.330368 -0.310183 2.729493
C  -1.523901 -0.816375 -0.023807
C  -2.470388 -1.781164 -0.540607
C  -1.917175 0.47367 -0.044738
N  -3.705869 -1.302951 -0.885664
N  -3.155088 0.859052 -0.430616
C  -4.117728 -0.0086 -0.846469
N  1.85116 -2.754989 -2.41625
C  2.567463 -1.703295 -2.90352
C  0.992258 -2.644286 -1.379752
N  2.294952 -0.524219 -2.284252
C  0.7494 -1.48414 -0.734978
C  1.403268 -0.312315 -1.265761
H  0.362959 -4.575354 -1.739659
H  -0.721242 -3.628734 -0.846366
H  -0.064376 1.334465 -0.074525
H  -1.345349 2.450904 -0.038039
H  -0.434548 -2.3827 0.759596
H  3.053397 0.144861 3.542132
H  2.57568 -0.855441 1.175426
H  2.770723 0.299051 -2.640121
H  1.994403 -3.655335 -2.863562
H  -3.41145 1.841334 -0.402235
H  -4.376392 -1.988522 -1.218301
H  -0.951359 1.62511 1.349451
H  0.697083 -4.260896 -0.151266
H  -1.405472 -0.33393 2.84934
elementType: S N O C H
totalener: -2175.78125115 hartree
nucrepener: 2599.43587655 hartree
electener: -4775.21712770 hartree
oneelecener: -8103.05466173 hartree
twoeener: 3327.83753403 hartree
cpcmener: -0.37689606 hartree
kineticenergy: 2168.38177370 hartree
exchangeener: -151.986330917823 hartree
correlationener: -6.965400966099 hartree
xcener: -158.951731883922 hartree
chargesum: 2.0000000
charge: -0.210876 -0.220628 -0.650380 -0.677412 -1.040381 -0.998548 0.983275 -0.415504 0.948272 0.119330 1.304083 0.026283 1.546677 0.772158 0.372878 -0.549037 -0.370231 0.477057 -0.482749 0.394370 1.245118 -0.402912 0.521836 0.159292 0.294488 0.234548 0.253606 0.296782 -0.486554 -0.555271 -0.806040 0.032681 0.015403 -0.013581 0.060727 0.358141 0.341761 -0.878664
charge: 0.565326 0.561326 0.537321 0.527335 0.166524 0.155679 -0.069959 -0.277735 -0.047531 1.007270 -0.260557 -0.253717 0.003540 -0.256966 -0.069725 0.183037 0.183266 -0.692250 0.185769 -0.691016 -0.060141 0.185452 -0.006414 -0.264295 0.117760 -0.041876 -0.053481 0.118768 0.063881 -0.030122 0.022010 0.065642 0.075276 0.073664 0.065572 0.086960 0.132127 -0.007720
qa: -0.2109 -0.2206 -0.6504 -0.6774 -1.0404 -0.9985 0.9833 -0.4155 0.9483 0.1193 1.3041 0.0263 1.5467 0.7722 0.3729 -0.5490 -0.3702 0.4771 -0.4827 0.3944 1.2451 -0.4029 0.5218 0.1593 0.2945 0.2345 0.2536 0.2968 -0.4866 -0.5553 -0.8060 0.0327 0.0154 -0.0136 0.0607 0.3581 0.3418 -0.8787
va: 1.7921 1.7855 2.8393 2.9697 1.3215 1.3288 1.2097 3.1017 0.4442 1.2911 2.5095 0.2512 0.7297 -1.0600 -2.3413 2.7648 2.4701 3.0509 2.7698 3.2148 -6.8084 2.7841 2.1309 1.7398 0.7173 0.9792 0.9097 0.7061 0.5858 0.6976 -0.0084 0.8630 0.8546 0.8624 0.8468 0.7722 0.7880 0.3515
energy: 29941.7 30042.4 32253.4 32722.1 33467.5 33726.1 33912.6 34088.8 35136.1 36073.7 36311.5 36365.5 36686.8 37607.7 38368.9 38906.2 39310.4 40305.2 40717.1 41038.9 41208.5 41753.2 42145.1 43094.8 44449.6 45034.8 45224.6 45266.5 45511.1 46354.5 46768.7 47016.6 47178.7 47273.5 47477.3 47665.0 47757.7 47811.6 47832.4 48582.8 48871.2 49545.0 49887.2 50577.7 50627.7 50797.0 50935.4 51252.2 51701.9 51780.3 51854.2 52021.9 52179.6 52359.5 52463.0 52559.6 52663.0 52744.6 52982.0 53112.6 53374.1 53459.8 53708.6 54121.0 54139.9 54158.8 54344.7 54525.6 54701.1 54769.9 54854.8 55021.2 55408.6 55750.6 55961.6 56076.0 56236.5 56309.4 56384.9 56442.4 56526.6 56597.2 56707.4 56759.7 56780.2 56898.6 57076.4 57138.8 57157.6 57290.2 57600.6 57745.5 57771.9 57816.5 57940.5 58089.1 58149.9 58249.4 58394.3 58464.8 58583.9 58652.7 58757.3 58905.0 59044.1 59246.1 59344.8 59389.3 59638.8 59732.5 59804.7 59847.9 59936.2 60087.1 60193.0 60301.8 60328.0 60428.0 60464.7 60519.8 60553.2 60752.3 60922.4 61054.1 61113.3 61192.4 61323.8 61357.4 61422.6 61540.1 61672.2 61741.9 61783.7 61838.6 61897.6 61928.4 62002.3 62120.0 62154.5 62278.3 62419.1 62436.9 62559.2 62606.5 62718.5 62773.7 62905.4 62958.7 62997.0 63068.2 63212.4 63272.1 63317.1 63392.0 63437.8 63471.1 63621.8 63644.9 63727.9 63805.1 63816.7 63845.2 63942.2 63945.2 64007.2 64062.6 64235.8 64254.2 64436.8 64443.3 64528.6 64593.3 64839.7 64900.6 64952.3 64985.1 65016.6 65028.7 65107.6 65168.1 65216.0 65308.5 65487.4 65498.4 65638.0 65652.9 65685.2 65867.6 65907.0 66008.3 66091.6 66146.7 66215.5 66288.0 66393.6 66450.3 66517.2 66634.2 66688.5 66859.2
energy: -2175.700184357102
dipole: 2.75371 -2.43484 0.31887 -2.69249 0.79196 -1.90054 4.48387 -3.47233 1.01153
magnitude: 2.17645 au
magnitude: 5.53209 debye
