program: Orca
programVersion: 5.0.4
elementType: S S H N N O O C C C C C S C C C N N C N C C N C C H H H H H H H H H H H
keywords: PBE0 aug-cc-pVDZ AutoAux D4 VeryTightSCF
charge: 0
multiplicity: 1
formula: C13H12N6O2S3
InChI: InChI=1/C13H12N6O2S3/c14-8-6(10(20)18-12(22)16-8)5(4-2-1-3-24-4)7-9(15)17-13(23)19-11(7)21/h1-3,5,16-19H,14-15H2
36 atoms
S  -4.1753 -4.28565 -2.01551
S  5.73245 -1.39823 -1.41889
H  -0.14511 3.57818 2.4436
N  -1.13631 -0.42553 -2.0213
N  1.98085 -3.14692 1.23735
O  -0.92525 -3.52625 1.56962
O  1.3323 0.73346 -1.43343
C  0.10862 -1.03751 0.63888
C  -1.60034 2.24116 1.46858
C  -1.5529 0.93403 0.91632
C  -0.40088 2.63881 1.97468
C  -0.31839 0.36081 0.99936
S  0.78611 1.42402 1.77895
C  1.49059 -1.12375 0.03234
C  1.97478 -0.19235 -0.9124
C  2.32899 -2.16062 0.41456
N  3.30781 -0.32826 -1.29331
N  3.61365 -2.20399 -0.05668
C  4.15387 -1.29686 -0.90197
N  -2.48249 -2.26366 -1.8487
C  -2.96832 -3.39591 -1.29304
C  -1.4929 -1.4830 -1.30598
N  -2.3917 -3.73942 -0.12678
C  -0.95178 -1.83192 -0.07891
C  -1.38069 -3.03683 0.52125
H  -2.88181 -1.99449 -2.73892
H  4.21312 -2.96836 0.22693
H  -1.53763 -0.27708 -2.93364
H  -0.32132 0.1300 -1.75034
H  1.00474 -3.2957 1.48303
H  2.63555 -3.88842 1.43477
H  -2.70467 -4.59306 0.31729
H  3.65602 0.35559 -1.95283
H  0.18938 -1.54051 1.60738
H  -2.48953 2.8586 1.48457
H  -2.40718 0.43676 0.47548
elementType: S H N O C
totalener: -2174.93479949 hartree
nucrepener: 2556.97479501 hartree
electener: -4731.90959449 hartree
oneelecener: -8070.62043977 hartree
twoeener: 3338.71084528 hartree
cpcmener: -0.07052815 hartree
kineticenergy: 2167.74861127 hartree
exchangeener: -151.869132114107 hartree
correlationener: -6.963052691418 hartree
xcener: -158.832184805525 hartree
chargesum: -0.0000000
charge: -0.307982 -0.311333 -0.553117 -0.107687 -0.210905 -0.942222 -1.048523 0.355399 0.038849 1.175008 0.042314 0.557657 0.026962 1.341948 0.487000 0.474287 -0.474970 -0.507109 0.513654 -0.358273 0.476784 -0.239689 -0.490933 1.184190 0.721881 -0.006947 0.030872 -0.083079 0.075354 -0.004961 -0.018906 0.022555 0.008042 -0.528915 -0.552938 -0.784267
charge: 0.477443 0.478527 -0.039509 0.376280 0.378472 0.058400 0.070043 -0.155811 -0.103256 -0.050010 -0.300529 -0.438085 1.050443 -0.061283 -0.354320 -0.177149 0.155341 0.168607 -0.714922 0.168495 -0.715093 -0.185597 0.156313 -0.048455 -0.340088 0.054289 0.055708 0.035524 -0.098398 -0.076376 0.036657 0.047234 0.046447 0.027685 0.004282 0.012689
qa: -0.3080 -0.3113 -0.5531 -0.1077 -0.2109 -0.9422 -1.0485 0.3554 0.0388 1.1750 0.0423 0.5577 0.0270 1.3419 0.4870 0.4743 -0.4750 -0.5071 0.5137 -0.3583 0.4768 -0.2397 -0.4909 1.1842 0.7219 -0.0069 0.0309 -0.0831 0.0754 -0.0050 -0.0189 0.0226 0.0080 -0.5289 -0.5529 -0.7843
va: 1.6892 1.6945 0.6191 3.0113 3.0188 1.2549 1.3735 2.2235 2.8700 0.1011 2.8410 3.5745 0.7079 1.6097 1.7379 -2.0863 2.9652 2.7728 2.9390 2.7053 3.0117 0.5634 2.8637 1.9555 -0.2688 0.8372 0.8249 0.8654 0.7666 0.9234 0.8281 0.8598 0.8526 0.7297 0.4926 -0.0204
energy: 33105.7 33193.1 34493.9 36577.2 37234.8 37833.7 38603.6 38856.2 39626.9 39870.2 40158.6 40501.6 40773.5 41172.8 41375.2 41577.2 42104.8 42302.9 42621.9 42762.9 42947.1 43646.4 43896.8 43941.2 44262.1 44907.3 45075.3 45317.6 45485.1 45641.2 45667.2 45797.5 46062.4 46196.4 46532.1 46577.4 46794.5 46941.5 47126.5 47160.8 47264.6 47384.3 47716.8 47751.0 47980.9 48044.4 48289.7 48444.3 48626.6 48926.9 49295.3 49351.2 49479.6 49764.2 50035.0 50133.5 50234.7 50302.6 50422.2 50505.9 50527.9 50611.6 50747.5 50957.5 51106.5 51179.0 51216.2 51441.8 51489.5 51580.4 51607.8 51690.4 51869.7 51918.3 52010.1 52132.4 52299.1 52493.3 52643.4 52785.0 52996.4 53041.4 53460.8 53542.8 53584.2 53719.7 53964.0 54084.7 54148.9 54321.5 54403.2 54522.9 54586.3 54737.6 54833.1 54862.0 54968.1 55047.5 55132.4 55153.6 55234.6 55365.0 55415.6 55455.4 55482.2 55587.4 55712.2 55752.6 55820.2 55906.4 55931.3 55977.0 56051.9 56136.9 56271.5 56419.2 56517.2 56554.9 56639.2 56675.4 56723.9 56787.9 56900.0 57082.9 57135.7 57214.9 57248.4 57362.8 57558.5 57628.8 57777.0 57860.1 57936.7 57956.8 58027.5 58139.0 58231.6 58275.3 58413.1 58590.0 58619.3 58685.3 58717.2 58859.2 58913.9 58933.8 59100.1 59195.5 59266.5 59351.5 59448.7 59514.7 59620.6 59682.0 59721.0 59770.4 59820.2 59872.2 59925.3 60012.8 60072.1 60098.6 60214.8 60244.6 60291.9 60430.8 60446.9 60574.4 60676.5 60730.2 60911.9 60971.0 61096.3 61125.2 61192.9 61293.9 61457.4 61504.1 61514.6 61601.1 61643.0 61699.4 61753.1 61889.5 61994.2 62114.6 62171.6 62232.4 62311.0 62461.5 62597.5 62664.9 62767.6 62793.5 62898.0 62930.9 62955.8 63038.9 63086.2 63221.6
energy: -2174.839543628296
dipole: -4.15255 4.07187 -0.08068 3.53003 -3.65906 -0.12903 2.44081 -2.44219 -0.00138
magnitude: 0.15218 au
magnitude: 0.38682 debye
