program: Orca
programVersion: 5.0.4
elementType: S S H N N O O C C C C C S C C C N N C N C C N C C H H H H H H H H H H H H H
keywords: PBE0 ma-def2-TZVP AutoAux D4 VeryTightSCF TightOPT
charge: 2
multiplicity: 1
formula: C13H14N6O2S3
InChI: InChI=1/C13H14N6O2S3/c14-8-6(10(20)18-12(22)16-8)5(4-2-1-3-24-4)7-9(15)17-13(23)19-11(7)21/h1-3,5,16-21H,14-15H2
38 atoms
S  3.463409 -2.190795 -4.412603
S  -5.552317 1.17302 -1.088555
H  0.537122 -0.528149 4.979362
N  1.577355 -3.580181 -0.073559
N  -0.889647 1.442255 0.529004
O  0.440974 0.669525 -1.952667
O  -2.631582 -2.679518 -1.155767
C  -0.298405 -1.440004 0.17523
C  1.720878 -0.229767 3.146995
C  1.51168 -0.478924 1.768917
C  0.652065 -0.598107 3.907052
C  0.281303 -1.03001 1.509429
S  -0.609691 -1.249784 2.963086
C  -1.598288 -0.735498 -0.180067
C  -2.649594 -1.426589 -0.779774
C  -1.858976 0.616732 0.083268
N  -3.822057 -0.837312 -1.044301
N  -3.057229 1.150042 -0.201488
C  -4.13413 0.483043 -0.775966
N  2.389653 -2.796947 -2.070585
C  2.528641 -1.912042 -3.131902
C  1.582252 -2.631203 -1.007145
N  1.803199 -0.755722 -2.924488
C  0.749826 -1.492303 -0.921887
C  0.975052 -0.523739 -1.89156
H  2.179079 -4.386411 -0.147027
H  -1.788138 -3.118453 -0.994613
H  0.060464 0.985564 -1.111251
H  -1.128715 2.393484 0.774704
H  -0.600739 -2.488653 0.316348
H  2.625809 0.198228 3.556602
H  2.250029 -0.266421 1.004653
H  1.930546 -0.019874 -3.610659
H  2.986215 -3.612497 -2.143764
H  -3.249335 2.12352 0.004116
H  -4.554399 -1.390157 -1.478166
H  -0.170624 1.015179 1.113589
H  1.237016 -3.370173 0.851974
totalener: -2175.69633862 hartree
nucrepener: 2622.52429433 hartree
electener: -4798.22063295 hartree
oneelecener: -8154.65686687 hartree
twoeener: 3356.43623392 hartree
kineticenergy: 2169.82609359 hartree
exchangeener: -152.075861044933 hartree
correlationener: -6.960068143752 hartree
xcener: -159.035929188685 hartree
chargesum: 2.0000000
charge: -0.152628 -0.139477 0.216142 -0.442706 -0.463056 -0.237821 -0.232886 0.776201 -0.323537 0.312740 0.052048 -0.440381 0.024790 -1.317703 0.066416 0.328268 -0.147799 -0.157746 0.004209 -0.107208 -0.006846 0.307578 -0.144530 0.090594 0.343452 0.302213 0.362433 0.394821 0.303485 0.176336 0.196427 0.192830 0.311453 0.285562 0.286326 0.313215 0.343537 0.323250
charge: 0.482019 0.495896 0.186778 0.039957 0.000020 0.136607 0.159032 -0.225491 -0.198490 -0.214088 -0.351167 -0.462842 0.824893 -0.143732 -0.272281 -0.269376 0.165161 0.144060 -0.622124 0.139096 -0.625937 -0.252744 0.157548 -0.138719 -0.287001 0.229901 0.248204 0.243705 0.230882 0.226925 0.195749 0.204955 0.274559 0.263466 0.264889 0.276788 0.239694 0.233209
qa: -0.1526 -0.1395 0.2161 -0.4427 -0.4631 -0.2378 -0.2329 0.7762 -0.3235 0.3127 0.0520 -0.4404 0.0248 -1.3177 0.0664 0.3283 -0.1478 -0.1577 0.0042 -0.1072 -0.0068 0.3076 -0.1445 0.0906 0.3435 0.3022 0.3624 0.3948 0.3035 0.1763 0.1964 0.1928 0.3115 0.2856 0.2863 0.3132 0.3435 0.3232
va: 2.1340 2.1534 0.9470 3.1630 3.0860 2.2634 2.2741 1.5916 4.5345 3.3568 3.7237 4.2671 2.7585 4.1049 4.2524 3.8029 3.1735 3.2787 4.2865 3.0901 4.3282 4.0745 3.2305 2.8190 4.0001 0.9261 0.9006 0.8546 0.9291 0.9031 0.9551 0.9560 0.9166 0.9354 0.9357 0.9168 0.9108 0.9109
energy: -2175.789764958522
dipole: 7.47393 -6.60948 0.86445 -0.38820 -0.12332 -0.51152 9.29948 -8.00352 1.29595
magnitude: 1.63964 au
magnitude: 4.16763 debye
