program: Gaussian 09
title: 000050416
version: EM64L-G09RevD.01
frameworkgroup: C1[X(C13H20N2O2)]
method: RPBEPBE
basis: SDD
operation: Freq
keyword: #p
keyword: freq=noraman
keyword: PBEPBE/SDD
title: #p freq=noraman PBEPBE/SDD
converged: YES YES NO NO
title: Mulliken charges:
elementType: O O N N C C C C C C C C C C C C C H H H H H H H H H H H H H H H H H H H H
charge: -0.340374 -0.286881 -0.299996 -0.411101 0.339721 -0.218450 -0.706704 -0.703820 -0.711251 0.501296 -0.722463 0.377285 -0.376080 -0.441761 -0.243129 -0.228833 -0.245998 0.196725 0.222642 0.204707 0.267703 0.225150 0.227839 0.203240 0.269563 0.207302 0.216945 0.283966 0.236258 0.205683 0.244934 0.302884 0.302227 0.226481 0.227534 0.221777 0.224983
chargesum: 0.00000
title: Mulliken charges with hydrogens summed into heavy atoms:
elementType: O O N N C C C C C C C C C C C C C
charge: -0.340374 -0.286881 -0.016030 -0.108217 0.339721 -0.021725 -0.011653 -0.047592 -0.017441 0.501296 -0.035588 0.377285 -0.073853 -0.215280 -0.015596 -0.007056 -0.021016
polarizability: 1.66258805e+02 1.23316385e+00 1.67348458e+02 -1.37075411e+01 -5.80196924e+00 1.39034600e+02
1716.lowfreq: -11.9695 -5.9178 -0.0009 -0.0007 -0.0002 2.5877 21.4110 26.9209 45.5679
frequency: 21.3312 26.8683 45.5364 60.3280 79.3823 112.7903 123.7181 154.0157 174.3472 196.2051 228.9711 229.9420 239.3517 244.5873 256.2069 292.2073 308.8969 329.2659 337.8243 403.0437 407.4177 428.5663 432.0063 438.7002 497.2157 522.6465 572.3402 603.8512 615.6942 651.0049 695.9826 707.7020 712.1553 747.8894 766.9462 769.6985 837.7381 860.2081 913.4705 919.1739 926.3622 928.4553 952.9978 955.5128 981.6073 988.8517 995.4297 1005.2570 1026.6166 1028.3371 1033.3550 1078.4182 1088.7784 1125.6666 1132.6316 1171.0088 1187.3075 1191.3909 1225.6254 1236.3041 1255.1959 1270.5327 1288.0898 1304.9238 1345.4976 1373.4883 1377.9867 1382.7450 1387.2778 1400.6655 1438.7151 1444.5784 1445.1464 1466.4134 1467.3373 1469.7030 1471.0252 1473.8396 1480.0460 1485.9052 1501.6903 1507.0818 1594.8409 1614.5099 1672.1698 2857.2152 2978.7244 2988.3588 2988.8231 2994.4348 3075.8209 3080.0882 3083.1403 3094.5753 3096.5830 3104.1553 3106.5819 3112.6519 3117.5226 3122.6055 3135.8047 3149.6804 3160.8583 3437.8761 3444.0330
redmass: 4.5928 3.1283 3.8592 3.9106 4.6066 4.2540 4.0344 3.7235 1.1025 2.9598 2.8978 1.1921 1.2732 2.0476 1.1309 3.0352 3.4006 2.5670 4.6152 2.6054 2.8463 2.3985 2.7952 2.7676 2.1370 2.9076 2.7517 1.4703 6.3348 3.5558 7.8932 2.3803 3.1867 3.6832 3.7862 1.7663 3.7334 1.2515 1.6035 1.6673 1.6940 1.3935 1.2046 5.6851 1.5640 2.7621 2.3286 1.4068 2.1514 1.4205 1.4284 1.7357 2.4225 4.0611 2.3889 1.0527 1.1294 2.4341 2.0100 2.7558 2.9757 3.0448 1.5340 1.3777 1.3352 1.2349 1.2344 1.2102 5.5790 1.2193 1.6021 1.5390 1.0518 1.0551 1.0510 1.0831 1.0740 1.1855 1.0528 1.8710 1.1065 1.3668 6.0547 5.9561 8.8549 1.0818 1.0383 1.0362 1.0356 1.0366 1.0966 1.0993 1.0991 1.0994 1.1001 1.0880 1.0995 1.1000 1.0992 1.0863 1.0919 1.0952 1.1010 1.0777 1.0746
irintensity: 1.0266 0.0062 0.5415 1.5152 4.2276 4.7771 1.6507 2.0085 0.5575 4.1934 2.0926 0.6312 1.2368 0.1975 0.2911 2.5490 3.9077 2.8011 7.7773 1.8892 0.2055 22.4729 0.8775 14.9418 48.6691 17.2962 43.7920 67.6644 0.0086 19.0183 15.0260 53.6969 36.7819 2.5555 6.2453 44.0693 7.9584 2.0521 0.9368 4.7439 4.5680 11.4560 0.3715 84.0288 3.6693 2.2843 13.0698 2.6316 8.6148 0.2162 9.7786 13.9218 42.0181 555.2940 100.4656 0.0409 2.3667 5.1227 17.6436 16.9215 26.7416 12.4130 2.5415 17.3386 6.4632 40.5843 41.1744 13.4931 2.3824 31.1884 13.2145 35.9211 0.6185 6.0335 2.4972 40.0189 9.1165 2.1032 4.1651 30.3067 7.4535 97.1059 1.2388 3.4625 190.9184 70.3544 41.1199 24.9081 12.4376 31.2385 35.9750 9.8879 16.8968 54.9192 39.9395 9.7581 19.3844 6.0445 15.0934 2.2329 31.6450 11.7345 27.6321 4.9230 21.3857
temp: 298.150 k
press: 1.00000 atm
elementType: 8 8 7 7 6 6 6 6 6 6 6 6 6 6 6 6 6 1 1 1 1 1 1 1 1 1 1 1 1 1 1 1 1 1 1 1 1
symmnumber: 1
zpe: 815100.0 jmol-1
zpe.correction: 0.310455 hartree
zpe.thermalcorrener: 0.328934 hartree
zpe.thermalcorrenthalpy: 0.329878 hartree
zpe.thermalcorrgfe: 0.262919 hartree
zpe.sumelectzpe: -766.012509 hartree
zpe.sumelectthermal: -765.994030 hartree
zpe.sumelectthermalent: -765.993086 hartree
zpe.sumelectthermalfe: -766.060045 hartree
dipole: -0.0081 -1.1434 2.6520
dipole: 2.8880
quadrupole: -94.0669 -90.8935 -103.8334
quadrupole: 4.7537 -2.1360 -4.0839
quadrupole: 2.1977 5.3711 -7.5688 4.7537 -2.1360 -4.0839
hfenergy: -766.3229641 hartree
pointgroup: C01 [X(C13H20N2O2)]
dipole: -0.012275 -0.267076 1.1043327 debye
polarizability: 166.97527|-0.7349557|164.4851944|-12.4906452|-11.0194619|141.1813994 unknown
InChI: InChI=1S/C13H20N2O2/c1-10(11-8-6-5-7-9-11)14-15-12(16)17-13(2,3)4/h5-10,14-15H,1-4H3
charge 0 multiplicity 1
37 atoms
O  2.388973 -0.217712 0.765382
O  1.444375 -0.751724 -1.351541
N  -0.565075 -2.153412 0.160519
N  0.548627 -1.499425 0.707214
C  3.532712 0.609964 0.19988
C  -1.894729 -1.689861 0.625876
C  2.959403 1.821279 -0.563111
C  4.26998 1.045456 1.478681
C  4.4215 -0.28226 -0.689925
C  -2.210668 -0.268862 0.150827
C  -2.941198 -2.699149 0.091497
C  1.452051 -0.810442 -0.099622
C  -1.733477 0.213163 -1.093128
C  -3.052524 0.557845 0.935315
C  -2.105675 1.498817 -1.545473
C  -3.428449 1.842176 0.481562
C  -2.956807 2.31586 -0.764914
H  -1.95242 -1.696444 1.743868
H  2.271656 2.393694 0.084273
H  3.78552 2.490001 -0.867872
H  2.414289 1.495388 -1.462776
H  4.621527 0.164291 2.043023
H  3.601174 1.634012 2.130208
H  5.144316 1.667893 1.216781
H  3.872383 -0.613434 -1.585313
H  5.313329 0.287593 -1.009475
H  4.762372 -1.169794 -0.127494
H  -0.460013 -3.175906 0.163133
H  -3.955526 -2.392435 0.39581
H  -2.756637 -3.717928 0.484908
H  -2.904699 -2.731293 -1.011374
H  0.68214 -1.429068 1.723545
H  -1.050782 -0.412176 -1.678824
H  -3.414597 0.196783 1.907477
H  -1.72534 1.865055 -2.506009
H  -4.080276 2.471973 1.09806
H  -3.242736 3.312982 -1.119186
