program: Orca
programVersion: 5.0.4
elementType: S S H N N O O C C C C C S C C C N N C N C C N C C H H H H H H H H H H H
keywords: PBE0 ma-def2-TZVP AutoAux D4 VeryTightSCF TightOPT
charge: 0
multiplicity: 1
formula: C13H12N6O2S3
InChI: InChI=1/C13H12N6O2S3/c14-8-6(10(20)18-12(22)16-8)5(4-2-1-3-24-4)7-9(15)17-13(23)19-11(7)21/h1-3,5,16-19H,14-15H2
36 atoms
S  4.175296 -4.285645 -2.015511
S  -5.732446 -1.398227 -1.418889
H  0.145105 3.578185 2.443604
N  1.136307 -0.425528 -2.0213
N  -1.98085 -3.146916 1.237345
O  0.925249 -3.526246 1.569624
O  -1.332298 0.733459 -1.433431
C  -0.10862 -1.03751 0.63888
C  1.600342 2.241156 1.468575
C  1.552897 0.934028 0.91632
C  0.400882 2.638805 1.974675
C  0.318386 0.360815 0.999357
S  -0.786112 1.424024 1.778955
C  -1.490585 -1.123747 0.032344
C  -1.974779 -0.192352 -0.912396
C  -2.328988 -2.160621 0.41456
N  -3.307806 -0.32826 -1.29331
N  -3.613653 -2.203991 -0.056678
C  -4.153873 -1.296862 -0.901965
N  2.482491 -2.263655 -1.848699
C  2.968321 -3.395909 -1.293037
C  1.492897 -1.482999 -1.305981
N  2.391696 -3.739417 -0.126781
C  0.951783 -1.83192 -0.078914
C  1.380685 -3.036831 0.521251
H  2.881812 -1.994492 -2.73892
H  -4.213116 -2.96836 0.226931
H  1.537631 -0.277082 -2.933636
H  0.321323 0.130005 -1.750337
H  -1.004735 -3.295704 1.483026
H  -2.635549 -3.88842 1.434774
H  2.704668 -4.593057 0.317295
H  -3.656015 0.355587 -1.95283
H  -0.189381 -1.540508 1.607381
H  2.489529 2.858602 1.484573
H  2.407175 0.436764 0.475484
totalener: -2175.11542501 hartree
nucrepener: 2560.83422330 hartree
electener: -4735.94964831 hartree
oneelecener: -8079.34755349 hartree
twoeener: 3343.39790518 hartree
cpcmener: -0.07527280 hartree
kineticenergy: 2168.91794997 hartree
exchangeener: -151.904797626822 hartree
correlationener: -6.951419342848 hartree
xcener: -158.856216969670 hartree
elementType: S H N O C
chargesum: 0.0000000
charge: -0.562026 -0.559209 0.214495 -0.518853 -0.571690 -0.671433 -0.631016 -0.474996 -0.366158 0.111485 -0.053618 -0.283023 -0.086981 0.815509 0.178385 0.166447 -0.195847 -0.149344 0.200473 -0.155212 0.187481 0.290264 -0.223866 -0.107521 0.260364 0.324377 0.323555 0.329231 0.330901 0.321691 0.332285 0.320574 0.322274 0.189411 0.187169 0.204421
charge: 0.146453 0.147902 0.177347 0.024886 0.021892 -0.107376 -0.093682 -0.198582 -0.244988 -0.211136 -0.421416 -0.382821 0.781737 -0.147180 -0.392082 -0.254230 0.128419 0.134159 -0.613928 0.131897 -0.613351 -0.263185 0.128554 -0.134784 -0.376912 0.269060 0.269239 0.233044 0.229221 0.226350 0.233174 0.267517 0.268252 0.244157 0.186257 0.206135
qa: -0.5620 -0.5592 0.2145 -0.5189 -0.5717 -0.6714 -0.6310 -0.4750 -0.3662 0.1115 -0.0536 -0.2830 -0.0870 0.8155 0.1784 0.1664 -0.1958 -0.1493 0.2005 -0.1552 0.1875 0.2903 -0.2239 -0.1075 0.2604 0.3244 0.3236 0.3292 0.3309 0.3217 0.3323 0.3206 0.3223 0.1894 0.1872 0.2044
va: 1.6559 1.6572 0.9447 2.9824 3.1176 1.7160 1.7840 4.3895 4.5289 3.6479 3.8737 4.4087 2.6413 1.1414 4.4164 4.2554 3.2692 3.1842 4.0254 3.1840 4.0471 4.1020 3.2691 3.4193 4.0830 0.9034 0.9027 0.9075 0.9253 0.9240 0.9061 0.9056 0.9039 0.9374 0.9583 0.9475
energy: -2175.240614824456
dipole: 4.15256 -4.09506 0.05751 3.53002 -3.68613 -0.15611 2.44083 -2.47476 -0.03393
magnitude: 0.16979 au
magnitude: 0.43156 debye
