program: Orca
programVersion: 5.0.4
elementType: S S Cl N N O O C C C C C C C C C C N N C N C C N C C H H H H H H H H H H H H Cl
keywords: PBE0 aug-cc-pVDZ AutoAux D4 VeryTightSCF
charge: 0
multiplicity: 1
formula: C15H12Cl2N6O2S2
InChI: InChI=1/C15H12Cl2N6O2S2/c16-4-1-2-5(6(17)3-4)7(8-10(18)20-14(26)22-12(8)24)9-11(19)21-15(27)23-13(9)25/h1-3,7,20-23H,18-19H2
39 atoms
S  -4.09226 -4.21829 -2.00468
S  5.62275 -1.52675 -1.6579
Cl -1.35195 4.5521 2.57238
N  -0.97817 -0.41239 -1.91296
N  1.91599 -3.2802 1.06488
O  -0.95435 -3.49328 1.69219
O  1.38709 0.88293 -1.15956
C  0.15984 -1.02517 0.77396
C  -1.82135 2.21078 1.30876
C  -1.45451 0.93977 0.90105
C  -0.93095 2.95266 2.06134
C  -0.21944 0.37967 1.20846
C  0.29177 2.42629 2.43334
C  0.62229 1.14859 2.01386
C  1.49634 -1.13225 0.07344
C  1.99197 -0.13118 -0.79176
C  2.27774 -2.2521 0.29939
N  3.29051 -0.31676 -1.26978
N  3.52336 -2.33402 -0.26387
C  4.08134 -1.37745 -1.03835
N  -2.35407 -2.23704 -1.79259
C  -2.89369 -3.34596 -1.24049
C  -1.38554 -1.46072 -1.20807
N  -2.37949 -3.6824 -0.04473
C  -0.91932 -1.79152 0.05316
C  -1.37768 -2.99685 0.64278
H  -2.70998 -1.96859 -2.7016
H  4.08552 -3.15719 -0.08903
H  -1.33791 -0.25307 -2.84103
H  -0.20878 0.17892 -1.5890
H  0.96445 -3.36961 1.41294
H  2.52892 -4.07441 1.16902
H  -2.72644 -4.52748 0.39003
H  3.65528 0.40963 -1.87186
H  0.28045 -1.56052 1.72289
H  -2.79018 2.61352 1.04158
H  -2.16728 0.36563 0.32507
H  0.97682 2.99179 3.05114
Cl 2.13105 0.51897 2.58986
elementType: S Cl N O C H
totalener: -2773.14776463 hartree
nucrepener: 3184.85926652 hartree
electener: -5958.00703115 hartree
twoeener: 4188.70564415 hartree
cpcmener: -0.06043555 hartree
kineticenergy: 2764.83910001 hartree
exchangeener: -182.061175418805 hartree
correlationener: -8.092144474238 hartree
xcener: -190.153319893043 hartree
chargesum: -0.0000000
charge: -0.316324 -0.323789 -0.323796 -0.109586 -0.206263 -0.906459 -1.010021 1.043415 -0.084903 1.494406 -0.238865 1.827356 0.495168 -0.687928 1.268101 0.488590 0.460356 -0.476646 -0.476267 0.429585 -0.322632 0.499529 -0.181938 -0.497297 0.905160 0.831201 -0.013110 0.018135 -0.085781 0.090845 -0.026699 -0.041550 0.020042 0.005339 -0.565033 -0.761237 -1.126944 -0.715437 -0.378722
charge: 0.470765 0.468766 0.592232 0.378397 0.374545 0.091950 0.108152 -0.106632 -0.002928 0.055076 -0.588519 -0.153972 -0.046673 -0.502118 -0.086538 -0.352102 -0.190314 0.155619 0.165929 -0.717003 0.167806 -0.714520 -0.192320 0.156510 -0.052173 -0.340731 0.054279 0.054503 0.036822 -0.094441 -0.079412 0.035775 0.045813 0.044954 0.029183 0.018212 0.012352 0.008477 0.694280
qa: -0.3163 -0.3238 -0.3238 -0.1096 -0.2063 -0.9065 -1.0100 1.0434 -0.0849 1.4944 -0.2389 1.8274 0.4952 -0.6879 1.2681 0.4886 0.4604 -0.4766 -0.4763 0.4296 -0.3226 0.4995 -0.1819 -0.4973 0.9052 0.8312 -0.0131 0.0181 -0.0858 0.0908 -0.0267 -0.0415 0.0200 0.0053 -0.5650 -0.7612 -1.1269 -0.7154 -0.3787
va: 1.6882 1.6851 0.5788 3.0095 3.0047 1.3087 1.4685 0.1277 1.7386 -3.0550 2.8507 1.1885 -0.0437 -1.1938 1.3492 1.7529 -1.8591 2.9818 2.8012 3.0408 2.6950 2.9966 0.4819 2.8397 2.6848 -0.6179 0.8402 0.8345 0.8598 0.7682 0.9563 0.8297 0.8628 0.8587 0.5643 0.3714 -0.8361 0.4183 0.6153
energy: 33199.6 33280.4 33904.4 35868.6 36881.5 37473.3 38301.0 38478.5 38822.1 39656.6 40695.6 40901.4 41039.4 41187.2 41283.2 41577.0 41767.9 41906.0 42271.4 42356.4 42589.6 42935.3 43171.6 43623.6 43953.8 44118.5 44165.8 44411.9 44821.9 45083.0 45163.8 45225.6 45337.0 45428.7 45572.5 45829.4 45933.7 45981.6 46127.2 46181.5 46315.6 46615.2 46777.1 46840.9 47146.5 47195.8 47367.6 47760.4 47840.6 47963.8 48111.7 48336.8 48414.4 48441.7 48544.7 48785.3 48954.5 49061.4 49099.6 49307.3 49444.5 49556.2 49740.4 49855.7 49914.5 49963.4 50029.3 50279.4 50328.6 50340.8 50443.4 50622.1 50708.2 50886.7 50945.8 51078.2 51268.7 51292.5 51395.8 51577.8 51642.2 51764.9 51838.9 51985.3 52087.1 52096.0 52181.6 52366.8 52489.4 52723.1 52766.3 52850.3 53002.5 53290.7 53470.0 53628.8 53669.3 53708.5 53769.2 53912.3 54093.5 54177.2 54299.9 54374.6 54410.4 54519.5 54568.3 54603.1 54644.5 54764.9 54827.1 54908.7 54946.5 55029.5 55103.7 55140.6 55181.8 55284.2 55367.5 55423.2 55472.2 55535.1 55623.3 55684.4 55849.3 55862.0 55929.3 55987.4 56074.6 56139.9 56162.8 56314.4 56340.5 56430.7 56565.3 56625.8 56728.6 56852.5 56901.0 57004.1 57028.6 57155.0 57220.1 57258.3 57376.7 57390.6 57568.7 57631.9 57801.6 57889.7 57954.7 58088.3 58163.5 58185.7 58232.8 58322.9 58396.7 58446.7 58549.6 58591.2 58647.2 58674.0 58724.5 58750.6 58794.7 58857.3 58937.6 59014.1 59037.7 59115.4 59169.8 59261.9 59371.4 59442.8 59491.9 59595.2 59644.6 59854.0 59895.3 59930.2 59970.7 60048.5 60075.2 60117.3 60168.0 60209.9 60296.0 60371.1 60391.4 60562.6 60601.5 60602.7 60678.3 60744.2 60800.2 60906.3 60933.8 61080.6 61134.3 61217.3
energy: -2773.060729572843
dipole: -2.97799 2.65135 -0.32664 -12.60823 11.85867 -0.74956 -8.85123 8.37243 -0.47880
magnitude: 0.94751 au
magnitude: 2.40839 debye
