program: Gaussian 09
title: 000050415
version: EM64L-G09RevD.01
frameworkgroup: C1[X(C12H18N2O3)]
method: RPBEPBE
basis: SDD
operation: Freq
keyword: #p
keyword: freq=noraman
keyword: PBEPBE/SDD
title: #p freq=noraman PBEPBE/SDD
converged: YES YES NO NO
title: Mulliken charges:
elementType: O O O N N C C C C C C C C C C C C H H H H H H H H H H H H H H H H H H
charge: -0.269711 -0.310746 -0.272921 -0.299526 -0.396906 -0.226889 0.512092 -0.722253 -0.426696 -0.375237 -0.357111 -0.374082 0.315947 0.347601 -0.217127 -0.538234 -0.675151 0.196883 0.243757 0.236257 0.204417 0.284477 0.228429 0.298305 0.246061 0.242705 0.305108 0.224786 0.225866 0.220673 0.221185 0.241773 0.209576 0.229590 0.227103
chargesum: 0.00000
title: Mulliken charges with hydrogens summed into heavy atoms:
elementType: O O O N N C C C C C C C C C C C C
charge: -0.269711 -0.310746 -0.272921 -0.015049 -0.091798 -0.030007 0.512092 -0.037822 -0.198267 -0.076932 -0.111049 -0.131377 0.315947 0.347601 0.233525 0.145397 -0.008882
polarizability: 1.58370706e+02 -1.46271986e+01 1.75326609e+02 5.48522916e+00 1.17139679e+01 1.31355772e+02
1716.lowfreq: -7.8539 -2.0825 -0.0008 -0.0006 -0.0004 6.3113 16.3644 34.9466 39.5286
frequency: 16.2137 34.8369 39.4562 62.1913 74.5082 85.0467 105.2779 124.7630 138.1154 170.6535 196.6305 217.0253 237.6288 249.4841 252.4490 266.0339 313.3075 322.4216 361.8872 380.0347 416.8999 430.9200 473.6797 501.9873 534.7181 559.2746 599.4420 628.3247 643.2582 689.9101 708.9150 723.6942 736.6889 790.8158 801.2128 825.0842 834.0521 856.0840 927.1180 950.3443 954.2102 975.7369 988.2693 992.6577 1005.3980 1039.8516 1087.6520 1105.9895 1108.9224 1112.4347 1131.1750 1139.8346 1142.0676 1156.1984 1176.1981 1221.5229 1230.3500 1234.3529 1249.5342 1291.5299 1299.3116 1323.5540 1357.9478 1384.2184 1390.5136 1398.1188 1418.1618 1435.6993 1444.9114 1462.6322 1465.6855 1470.2813 1473.0631 1475.9547 1477.6020 1490.4557 1502.4108 1513.9732 1587.2926 1623.6168 1687.2356 2855.5701 2957.5155 2976.6594 2993.7583 3005.5524 3044.5920 3062.7177 3074.2490 3091.1893 3104.2031 3105.7777 3110.2025 3120.1872 3143.6535 3160.7842 3164.0348 3435.3307 3441.3019
redmass: 3.5408 3.1393 3.1343 3.6383 3.4981 5.5992 3.4593 3.9212 3.9103 3.6990 2.6663 2.2325 1.1291 1.5321 1.1858 3.1312 4.1594 4.8426 3.8761 3.9627 3.0104 4.0267 1.8582 3.1684 2.9838 2.9680 1.5393 6.4938 2.8711 5.5974 4.7298 3.5967 3.6187 4.7388 1.0953 1.2521 1.6228 3.3384 1.7014 1.5507 3.6355 1.3855 5.2628 2.4932 2.3150 2.7738 2.6048 1.6241 2.1480 1.2636 2.2404 1.6065 3.0014 1.3421 1.2949 1.9864 2.8883 3.0669 1.1316 1.4914 1.2931 1.5703 1.3255 1.2114 3.7782 1.2720 3.0113 1.1725 1.2277 1.0409 1.0502 1.0744 1.0840 1.0762 1.0542 1.0864 2.2537 1.5330 7.0376 6.2983 9.5890 1.0819 1.0328 1.0388 1.0356 1.0579 1.1038 1.1068 1.0960 1.0986 1.1025 1.1000 1.0896 1.0994 1.0879 1.0950 1.0953 1.0776 1.0746
irintensity: 0.5020 0.9583 1.3172 2.2739 4.5048 5.3987 4.6673 4.8549 1.1022 7.4727 1.2017 2.4569 0.2874 0.2501 0.7592 1.6150 5.1415 8.1186 2.6801 1.5639 0.7798 2.0918 72.9745 38.5130 21.1881 18.1848 88.0571 4.1525 21.7215 20.1903 2.6473 38.4023 3.0553 10.6320 3.3591 0.2980 83.2466 0.7020 4.7434 12.5584 46.2508 7.7089 44.5851 2.4686 3.2591 75.8062 50.4616 22.1901 47.5970 0.4576 42.0716 66.1817 297.1518 3.5129 74.0714 59.3916 90.2652 56.7213 0.1645 6.7661 11.6657 22.0744 1.5865 14.7755 6.7096 26.5588 3.2111 12.2241 27.5678 10.9306 12.6528 25.4688 37.5551 15.1496 4.9209 12.8281 131.4097 65.2328 14.7736 45.7536 223.0557 72.1666 65.6279 45.8170 23.0333 24.4263 49.9941 10.7238 40.5224 32.2752 47.7420 15.1779 21.4596 27.8848 4.5462 9.2294 8.9444 4.7027 20.2904
temp: 298.150 k
press: 1.00000 atm
elementType: 8 8 8 7 7 6 6 6 6 6 6 6 6 6 6 6 6 1 1 1 1 1 1 1 1 1 1 1 1 1 1 1 1 1 1
symmnumber: 1
zpe: 754569.6 jmol-1
zpe.correction: 0.287400 hartree
zpe.thermalcorrener: 0.305803 hartree
zpe.thermalcorrenthalpy: 0.306747 hartree
zpe.thermalcorrgfe: 0.238834 hartree
zpe.sumelectzpe: -801.908974 hartree
zpe.sumelectthermal: -801.890571 hartree
zpe.sumelectthermalent: -801.889627 hartree
zpe.sumelectthermalfe: -801.957540 hartree
dipole: -0.9777 0.6364 1.2054
dipole: 1.6775
quadrupole: -97.5686 -81.5364 -103.3575
quadrupole: -2.6338 -8.0084 6.9276
quadrupole: -3.4144 12.6178 -9.2033 -2.6338 -8.0084 6.9276
hfenergy: -802.1963742 hartree
pointgroup: C01 [X(C12H18N2O3)]
dipole: 0.4054725 0.1860187 -0.4863628 debye
polarizability: 159.0323537|16.0129833|171.3803068|4.1502639|-15.8071896|134.6404269 unknown
InChI: InChI=1S/C12H18N2O3/c1-4-17-12(15)14-13-9(2)10-5-7-11(16-3)8-6-10/h5-9,13-14H,4H2,1-3H3
charge 0 multiplicity 1
35 atoms
O  -3.840048 -1.890894 -0.222114
O  3.218602 -0.748429 -0.252175
O  2.075882 -0.133167 1.720244
N  1.229064 2.205907 0.231486
N  2.086307 1.201503 -0.244418
C  -0.018876 2.422919 -0.543262
C  -0.972537 1.231921 -0.437007
C  -0.669135 3.718995 0.00174
C  -1.855686 0.937567 -1.507841
C  -1.046541 0.447511 0.736531
C  -2.799814 -0.101347 -1.408825
C  -1.984372 -0.603454 0.851084
C  -2.867685 -0.874766 -0.223093
C  2.404291 0.097048 0.534429
C  3.674552 -1.990389 0.429076
C  -3.9425 -2.720415 0.979599
C  4.540636 -2.746866 -0.574124
H  0.207334 2.58459 -1.627921
H  -0.891264 3.605895 1.077233
H  -1.615251 3.919783 -0.527644
H  -0.005005 4.595087 -0.135813
H  1.73365 3.074621 0.450568
H  -1.804718 1.526627 -2.433066
H  -0.340343 0.642439 1.550815
H  -3.484184 -0.335808 -2.230023
H  -2.007019 -1.200047 1.768254
H  2.419808 1.200838 -1.216484
H  4.233467 -1.709479 1.340447
H  2.785522 -2.570664 0.73678
H  -4.202222 -2.113258 1.868881
H  -3.000842 -3.271133 1.17135
H  -4.752898 -3.43401 0.768513
H  4.907427 -3.685232 -0.119311
H  3.962728 -3.001895 -1.47909
H  5.413272 -2.142594 -0.876616
