program: Orca
programVersion: 5.0.4
elementType: S S H N N O O C C C C C C C C C C N N C N C C N C C H H H H H H H H Cl
keywords: PBE0 ma-def2-TZVP AutoAux D4 VeryTightSCF TightOPT
charge: -4
multiplicity: 1
formula: C15H9ClN6O2S2
InChI: InChI=1/C15H9ClN6O2S2/c16-6-4-2-1-3-5(6)7(8-10(17)19-14(25)21-12(8)23)9-11(18)20-15(26)22-13(9)24/h1-4,7H,17-18H2
35 atoms
S  4.023002 -2.30687 -3.805417
S  -5.683455 0.740296 -1.031724
H  1.578365 0.466432 5.099822
N  0.257976 -3.851449 -0.990664
N  -0.965496 1.561125 0.244708
O  1.336379 0.784811 -1.071512
O  -2.372443 -2.891652 -0.666738
C  -0.230984 -1.345774 0.304699
C  1.989895 0.278926 2.992127
C  1.523171 -0.178316 1.769704
C  1.228648 0.10856 4.137924
C  0.288261 -0.811205 1.628482
C  0.012536 -0.5466 4.04554
C  -0.430836 -1.001659 2.812267
C  -1.558734 -0.745279 -0.122344
C  -2.584926 -1.649997 -0.5454
C  -1.891622 0.600015 -0.100539
N  -3.832969 -1.162705 -0.818252
N  -3.128837 1.056526 -0.380992
C  -4.059136 0.147822 -0.710069
N  1.963476 -3.005023 -2.285018
C  2.71284 -1.964912 -2.68589
C  1.018917 -2.758078 -1.361218
N  2.512518 -0.704504 -2.301092
C  0.807265 -1.504455 -0.791177
C  1.539962 -0.425573 -1.379728
H  0.38829 -4.622061 -1.630843
H  -0.732621 -3.620431 -0.82595
H  -0.026021 1.338466 -0.120497
H  -1.283076 2.486316 -0.009721
H  -0.523969 -2.367346 0.561618
H  2.953648 0.773972 3.046135
H  2.119336 -0.017765 0.883563
H  -0.59107 -0.722147 4.92814
Cl -1.929051 -1.886005 2.808525
totalener: -2311.96370451 hartree
nucrepener: 2761.63832228 hartree
electener: -5073.60202679 hartree
oneelecener: -8768.88707337 hartree
twoeener: 3695.28504658 hartree
cpcmener: -0.87193275 hartree
kineticenergy: 2305.19663501 hartree
exchangeener: -161.318358696554 hartree
correlationener: -7.411871405875 hartree
xcener: -168.730230102429 hartree
elementType: S H N O C Cl
chargesum: -4.0000000
charge: -0.938337 -0.950882 0.174363 -0.609611 -0.609129 -0.754132 -0.762307 0.204390 -0.453439 0.776857 0.080437 -1.477967 -0.224326 0.477384 0.914990 0.372430 0.107201 -0.749264 -0.802899 0.376574 -0.740963 0.350228 0.505846 -0.703857 -0.728472 0.534980 0.272698 0.319161 0.321699 0.265901 0.110395 0.170359 0.187156 0.191087 -0.208550
charge: -0.221281 -0.228123 0.186385 -0.143850 -0.124984 -0.183424 -0.196030 -0.190584 -0.181980 -0.134867 -0.184505 -0.157849 -0.192397 -0.410999 -0.186114 -0.462905 -0.365329 -0.089821 -0.092167 -0.697026 -0.090821 -0.692889 -0.355720 -0.081472 -0.169258 -0.463844 0.204117 0.209837 0.216403 0.204282 0.235532 0.186809 0.215754 0.194385 0.444735
qa: -0.9383 -0.9509 0.1744 -0.6096 -0.6091 -0.7541 -0.7623 0.2044 -0.4534 0.7769 0.0804 -1.4780 -0.2243 0.4774 0.9150 0.3724 0.1072 -0.7493 -0.8029 0.3766 -0.7410 0.3502 0.5058 -0.7039 -0.7285 0.5350 0.2727 0.3192 0.3217 0.2659 0.1104 0.1704 0.1872 0.1911 -0.2086
va: 1.0944 1.0755 0.9514 2.7623 2.8454 1.6691 1.6664 2.1846 4.1946 2.1734 3.6381 3.7064 4.1474 3.0812 0.1824 3.9337 4.2847 2.5418 2.6453 3.6620 2.6268 3.6855 3.3507 2.5732 2.5110 3.6622 0.9431 0.9362 0.9354 0.9455 1.0051 0.9535 0.9460 0.9387 1.0482
energy: -2312.039722658351
dipole: 9.31233 -6.84149 2.47084 3.36216 -3.43670 -0.07455 8.25336 2.77317 11.02653
magnitude: 11.30022 au
magnitude: 28.72287 debye
