program: Orca
programVersion: 5.0.4
elementType: S S H N N O O C C C C C C C C C C N N C N C C N C C H H H H H H H H Cl
keywords: PBE0 ma-def2-TZVP D4 AutoAux TightSCF VerySlowConv FREQ
charge: -4
multiplicity: 1
frequency: 0.00 0.00 0.00 0.00 0.00 0.00 27.42 37.40 44.43 63.45 66.00 110.48 115.82 138.29 143.73 169.68 176.90 199.17 205.67 218.76 225.02 228.31 248.77 262.51 290.39 320.47 332.52 372.40 382.49 400.33 434.68 445.87 477.59 496.69 532.08 543.95 547.19 558.86 571.38 590.41 618.80 623.37 631.98 669.71 703.56 707.08 713.28 724.51 737.55 740.45 752.27 772.67 814.09 829.40 841.49 854.57 880.70 891.04 897.74 903.12 956.50 958.94 988.03 1061.47 1066.37 1078.50 1085.05 1110.49 1124.25 1141.54 1170.83 1189.33 1199.37 1206.80 1240.84 1268.34 1282.93 1307.96 1323.93 1327.62 1337.45 1391.75 1399.00 1413.44 1462.26 1476.20 1487.06 1499.61 1515.94 1527.26 1573.39 1586.15 1595.47 1635.01 1677.99 1684.93 3042.71 3114.84 3130.12 3140.58 3162.38 3166.41 3169.81 3595.98 3602.27
frequency: 27.42 37.40 44.43 63.45 66.00 110.48 115.82 138.29 143.73 169.68 176.90 199.17 205.67 218.76 225.02 228.31 248.77 262.51 290.39 320.47 332.52 372.40 382.49 400.33 434.68 445.87 477.59 496.69 532.08 543.95 547.19 558.86 571.38 590.41 618.80 623.37 631.98 669.71 703.56 707.08 713.28 724.51 737.55 740.45 752.27 772.67 814.09 829.40 841.49 854.57 880.70 891.04 897.74 903.12 956.50 958.94 988.03 1061.47 1066.37 1078.50 1085.05 1110.49 1124.25 1141.54 1170.83 1189.33 1199.37 1206.80 1240.84 1268.34 1282.93 1307.96 1323.93 1327.62 1337.45 1391.75 1399.00 1413.44 1462.26 1476.20 1487.06 1499.61 1515.94 1527.26 1573.39 1586.15 1595.47 1635.01 1677.99 1684.93 3042.71 3114.84 3130.12 3140.58 3162.38 3166.41 3169.81 3595.98 3602.27
formula: C15H9ClN6O2S2
InChI: InChI=1/C15H9ClN6O2S2/c16-6-4-2-1-3-5(6)7(8-10(17)19-14(25)21-12(8)23)9-11(18)20-15(26)22-13(9)24/h1-4,7H,17-18H2
35 atoms
S  4.211804 -2.495022 -3.655639
S  -5.766979 0.789401 -0.707616
H  1.515301 0.391546 5.15246
N  0.14851 -3.777423 -1.097219
N  -0.902759 1.588641 -0.032379
O  1.559693 0.780736 -1.052481
O  -2.451816 -2.89823 -0.454749
C  -0.213415 -1.311489 0.262162
C  1.86847 0.40595 3.014799
C  1.425258 -0.020057 1.772221
C  1.178787 0.059586 4.17069
C  0.270148 -0.797007 1.608935
C  0.039695 -0.721824 4.052284
C  -0.392931 -1.136001 2.797252
C  -1.574752 -0.732252 -0.105143
C  -2.652765 -1.646408 -0.382142
C  -1.886242 0.62008 -0.178107
N  -3.912743 -1.147541 -0.565042
N  -3.128806 1.086388 -0.38689
C  -4.10319 0.169265 -0.532524
N  1.988007 -3.044386 -2.272753
C  2.844219 -2.060191 -2.599094
C  1.024028 -2.733774 -1.393188
N  2.715844 -0.794781 -2.210942
C  0.867837 -1.477327 -0.805155
C  1.714378 -0.450844 -1.347371
H  0.246013 -4.488068 -1.80804
H  -0.827749 -3.487912 -0.932448
H  0.009562 1.318992 -0.437073
H  -1.255342 2.466545 -0.386594
H  -0.496953 -2.341409 0.506968
H  2.764147 1.022417 3.074311
H  1.940527 0.287318 0.866259
H  -0.527673 -1.027433 4.927089
Cl -1.808873 -2.144028 2.76563
totalener: -2311.13914964 hartree
nucrepener: 2747.79738972 hartree
electener: -5058.93653936 hartree
oneelecener: -8733.67940188 hartree
twoeener: 3674.74286252 hartree
kineticenergy: 2304.80492084 hartree
exchangeener: -161.213074181442 hartree
correlationener: -7.390456569880 hartree
chargesum: -4.0000000
charge: -1.136121 -1.121571 0.082522 -0.414895 -0.447915 -0.706342 -0.676398 1.009662 1.912673 -2.016439 -4.265021 3.969551 2.962567 -2.244843 1.427038 0.283442 0.079193 -0.484798 -0.593733 0.252385 -0.574853 0.269231 0.408734 -0.525687 -3.027232 0.317146 0.191841 0.313220 0.323418 0.185569 0.146658 0.068332 0.217707 0.093846 -0.278886
charge: -0.278893 -0.279116 0.158112 -0.158298 -0.136481 -0.202490 -0.201191 -0.184727 -0.224559 -0.105412 -0.336413 -0.123172 -0.252281 -0.398660 -0.163819 -0.448717 -0.347546 -0.023702 -0.046004 -0.644625 -0.048788 -0.647760 -0.338514 -0.018537 -0.145146 -0.442617 0.186734 0.208225 0.213620 0.187832 0.239880 0.164328 0.224431 0.171286 0.443020
qa: -1.1361 -1.1216 0.0825 -0.4149 -0.4479 -0.7063 -0.6764 1.0097 1.9127 -2.0164 -4.2650 3.9696 2.9626 -2.2448 1.4270 0.2834 0.0792 -0.4848 -0.5937 0.2524 -0.5749 0.2692 0.4087 -0.5257 -3.0272 0.3171 0.1918 0.3132 0.3234 0.1856 0.1467 0.0683 0.2177 0.0938 -0.2789
va: 0.6286 0.6462 0.9366 2.4510 2.4561 1.5613 1.5568 -0.6917 -4.7248 5.5991 -4.7614 -18.9217 -11.6027 3.6837 -2.9816 4.1159 4.3384 2.5984 2.5786 3.9985 2.5584 3.9126 3.4730 2.6365 0.8664 4.0679 0.9919 0.9534 0.9389 0.9927 0.9984 0.9655 0.9436 0.9556 0.8904
energy: -2311.202215189812
dipole: 8.46787 -7.70897 0.75889 4.35026 -4.86519 -0.51493 7.03973 -0.95521 6.08452
magnitude: 6.15325 au
magnitude: 15.64032 debye
temp: 298.15 k
press: 1.00 atm
zeropoint: 0.23183452 hartree
thermalvibcorrection: 0.01849054 hartree
thermalrotcorrection: 0.00141627 hartree
thermaltrasncorrection: 0.00141627 hartree
thermaltotal: -2310.94905758 hartree
thermalcorr: 0.02132309 hartree
nonthermalcorr: 0.23183452 hartree
totalcorr: 0.25315761 hartree
thermalcorrenthalpy: 0.00094421 hartree
totalenthalpy: -2310.94811337 hartree
totalentropycorr: -0.07025701 hartree
gibbsenthalpy: -2311.01837038 hartree
gibbsminuselec: 0.18384481 hartree
