program: Gaussian 09
title: 000050499
version: EM64L-G09RevD.01
frameworkgroup: C1[X(C19H20ClNO2)]
method: RPBEPBE
basis: SDD
operation: Freq
keyword: #p
keyword: freq=noraman
keyword: PBEPBE/SDD
title: #p freq=noraman PBEPBE/SDD
converged: YES YES NO NO
title: Mulliken charges:
elementType: Cl O O N C C C C C C C C C C C C C C C C C C C H H H H H H H H H H H H H H H H H H H H
charge: -0.024059 -0.285293 -0.428184 -0.106449 -0.495602 0.287889 0.300363 -0.310058 -0.318980 0.149217 0.153710 -0.540342 0.345948 -0.366742 -0.394047 -0.686231 -0.666201 0.309272 -0.389845 -0.368452 -0.239354 -0.231026 -0.244451 0.224991 0.220711 0.180750 0.225710 0.183256 0.201454 0.256301 0.220131 0.227857 0.204339 0.206425 0.223517 0.220355 0.195351 0.354776 0.249223 0.266242 0.228111 0.228226 0.231192
chargesum: 0.00000
title: Mulliken charges with hydrogens summed into heavy atoms:
elementType: Cl O O N C C C C C C C C C C C C C C C C C C C
charge: -0.024059 -0.285293 -0.073408 -0.106449 -0.049900 0.287889 0.300363 0.096402 0.065730 0.149217 0.153710 -0.540342 0.345948 -0.110442 -0.173916 -0.047609 -0.026977 0.309272 -0.140623 -0.102211 -0.011243 -0.002800 -0.013258
polarizability: 3.91025990e+02 -2.83314335e+01 2.44730281e+02 1.84359531e+01 1.98975200e+01 1.32710032e+02
1716.lowfreq: -4.3541 0.0017 0.0019 0.0021 2.9708 6.5973 14.8677 26.8815 36.2170
frequency: 14.7111 26.5275 36.2007 48.2532 60.7492 72.4947 84.9798 107.4172 124.3431 135.4429 165.1893 179.0172 194.9710 202.0180 221.9925 258.1320 271.2683 279.7928 286.9041 297.2105 320.4276 338.7239 356.9327 376.0020 398.9941 400.7511 432.0420 456.1517 478.3145 485.2392 492.2580 530.8602 581.1084 612.0354 616.9274 636.2539 655.1574 671.6462 694.6882 720.4247 741.7265 759.1679 773.0569 777.6819 783.7674 797.4930 799.6277 852.0888 879.7722 908.7498 918.0985 930.8547 953.8682 976.2238 983.8758 987.6583 1000.3686 1009.9218 1023.7212 1038.2688 1052.3350 1058.0927 1073.7003 1086.5671 1095.5796 1108.5544 1146.7219 1161.0529 1175.5431 1195.9221 1198.6681 1200.6918 1229.7233 1232.6949 1249.2611 1270.9635 1279.7866 1285.9672 1292.1037 1332.8608 1358.1119 1362.7562 1374.8590 1381.6816 1384.6292 1391.6206 1394.6168 1430.6841 1438.9462 1460.4249 1462.3970 1466.9720 1470.6899 1473.3498 1478.6052 1484.5442 1490.2770 1497.8884 1566.4327 1582.1905 1591.0970 1614.7853 1625.6217 2840.0484 2854.1911 2935.4096 2982.1152 2986.0831 3036.4436 3038.0673 3057.2320 3074.7178 3080.0617 3090.8411 3096.3007 3124.3804 3129.2193 3140.8350 3159.1533 3175.6979 3178.4988 3186.3430 3584.8117
redmass: 3.7460 4.5115 3.9475 4.5093 5.8200 2.0979 2.7779 4.8923 2.8493 3.7565 4.2430 1.4382 9.2359 2.9628 1.6887 3.1940 3.3924 2.4314 2.0251 2.1659 3.1212 5.1675 2.7061 5.4441 4.9331 2.8453 2.8779 2.9985 5.0861 3.7159 7.9071 4.0427 6.6223 4.9192 5.0675 6.4218 5.6978 5.7660 1.7813 5.1717 4.1825 6.1132 3.3431 1.8793 1.7125 1.1832 1.3022 1.2533 2.6437 1.3231 2.4567 1.4377 4.2568 2.3187 1.3852 6.1080 1.3234 3.4440 3.4609 2.4381 2.7323 2.4807 2.0684 2.0346 1.7473 1.8378 1.3067 1.7485 1.0550 2.2924 1.3416 1.5422 2.5650 3.5424 3.7357 1.3208 1.4270 1.2529 2.6093 1.4149 1.3061 1.3624 1.4222 7.1439 1.2408 1.2410 3.3513 4.4008 2.5895 1.0655 1.0556 1.0588 2.3770 1.0738 1.1024 1.0700 1.0777 3.1223 7.6764 6.2841 8.4088 5.9667 8.1611 1.0725 1.0717 1.0690 1.0356 1.0362 1.0857 1.0878 1.0892 1.0977 1.0981 1.1003 1.1001 1.0898 1.0853 1.0902 1.0961 1.0956 1.0957 1.0953 1.0662
irintensity: 0.0053 0.2078 0.3395 0.2658 0.6635 0.3597 0.2209 0.9338 4.3463 0.1202 0.1859 1.6717 0.9180 2.7025 0.8085 14.1948 16.2241 33.3257 42.6209 9.7048 2.8591 2.0026 4.9092 1.5906 5.6577 0.0759 3.1769 1.1904 2.2501 3.8234 3.6181 3.4288 9.6926 1.6319 1.7918 2.9358 10.1830 20.0181 52.1199 5.9599 6.5862 17.6781 25.7259 80.5123 25.4818 5.1338 4.9910 0.0964 12.9847 1.7732 20.8935 4.8218 18.6170 11.6781 0.0739 0.0268 0.3410 5.2798 27.0454 162.1072 44.2066 41.9343 14.1402 2.2331 4.1649 0.6226 36.7934 27.1718 0.1453 24.3402 26.7224 7.6042 82.7502 39.6240 31.1491 1.0376 19.6714 19.6985 18.1186 0.1361 7.7909 8.8332 3.7675 0.9499 22.4037 13.8660 105.1182 6.1701 17.4637 1.1986 7.5043 4.8770 39.4442 6.3755 11.6545 8.7567 11.9357 1.6735 2.0191 1.6737 29.5016 10.7640 5.6003 66.1183 128.0562 58.9007 35.5112 41.1445 9.3213 18.3451 7.5672 43.7316 72.0596 44.4598 41.1109 13.1248 1.0644 17.3704 36.3677 10.0350 3.3598 8.8170 48.7961
temp: 298.150 k
press: 1.00000 atm
elementType: 17 8 8 7 6 6 6 6 6 6 6 6 6 6 6 6 6 6 6 6 6 6 6 1 1 1 1 1 1 1 1 1 1 1 1 1 1 1 1 1 1 1 1
symmnumber: 1
zpe: 900064.1 jmol-1
zpe.correction: 0.342816 hartree
zpe.thermalcorrener: 0.364992 hartree
zpe.thermalcorrenthalpy: 0.365936 hartree
zpe.thermalcorrgfe: 0.289601 hartree
zpe.sumelectzpe: -1399.580527 hartree
zpe.sumelectthermal: -1399.558352 hartree
zpe.sumelectthermalent: -1399.557408 hartree
zpe.sumelectthermalfe: -1399.633742 hartree
dipole: 0.0383 1.6030 0.3519
dipole: 1.6416
quadrupole: -127.7329 -123.8432 -148.1848
quadrupole: -8.0760 1.8063 3.5649
quadrupole: 5.5207 9.4104 -14.9312 -8.0760 1.8063 3.5649
hfenergy: -1399.9233434 hartree
pointgroup: C01 [X(C19H20Cl1N1O2)]
dipole: -0.011785 -0.6457492 -0.0035914 debye
polarizability: 384.523662|-22.0630796|247.5675026|-48.107959|8.2010894|136.3751381 unknown
InChI: InChI=1S/C19H20ClNO2/c1-3-21(4-2)12-14-15(22)10-11-16-17(14)18(20)19(23-16)13-8-6-5-7-9-13/h5-11,22H,3-4,12H2,1-2H3
charge 0 multiplicity 1
43 atoms
Cl -0.50977 2.248862 -0.593903
O  -1.609202 -1.57987 0.021777
O  3.770217 -1.725084 -1.373067
N  3.460673 1.116847 0.085352
C  2.600035 0.785326 -1.090923
C  1.780304 -0.475961 -0.86439
C  0.391791 -0.507406 -0.538518
C  2.685689 1.646238 1.23854
C  4.609593 1.978691 -0.301326
C  -0.248174 -1.761002 -0.293348
C  2.421311 -1.739673 -0.969815
C  -0.675779 0.46843 -0.365674
C  -1.865302 -0.178192 -0.029954
C  0.394247 -2.998811 -0.364082
C  1.757854 -2.973997 -0.719713
C  3.428284 1.495718 2.580307
C  5.743214 1.196566 -0.992883
C  -3.246624 0.208745 0.263798
C  -3.669443 1.568355 0.320254
C  -4.210449 -0.814923 0.508795
C  -5.012223 1.886425 0.609609
C  -5.548996 -0.487785 0.797603
C  -5.960292 0.865128 0.849432
H  3.275373 0.600226 -1.943337
H  1.937906 1.635549 -1.367859
H  2.391143 2.716154 1.084315
H  1.74464 1.07092 1.298616
H  4.279816 2.827026 -0.955993
H  5.011904 2.437014 0.619996
H  -0.136764 -3.932606 -0.164139
H  2.31095 -3.91735 -0.809974
H  3.683961 0.435721 2.752857
H  4.364729 2.081946 2.609827
H  2.789276 1.847577 3.411906
H  6.121877 0.409736 -0.318182
H  5.397148 0.700296 -1.916355
H  6.574993 1.876373 -1.258678
H  4.145417 -2.639884 -1.371148
H  -2.953798 2.373726 0.142006
H  -3.895608 -1.861199 0.469407
H  -5.317967 2.937761 0.64877
H  -6.273328 -1.28876 0.982234
H  -7.002029 1.119048 1.073861
