program: Orca
programVersion: 5.0.4
elementType: S S H N N O O C C C C C C C C C C N N C N C C N C C H H H H H H H H O H H H H H H C H H H
keywords: PBE0 aug-cc-pVDZ AutoAux D4 VeryTightSCF
charge: 2
multiplicity: 1
formula: C16H18N6O3S2
InChI: InChI=1/C16H18N6O3S2/c1-25-7-5-3-2-4-6(7)8(9-11(17)19-15(26)21-13(9)23)10-12(18)20-16(27)22-14(10)24/h2-5,8,19-22H,1,17-18H3
45 atoms
S  3.692389 -2.093955 -4.108983
S  -5.462911 0.773137 -1.549659
H  1.501408 0.741763 5.04392
N  0.250418 -3.869747 -0.947703
N  -0.890504 1.598062 0.284036
O  1.228598 0.805843 -1.052909
O  -2.250034 -2.847159 -0.837165
C  -0.201864 -1.342501 0.381518
C  2.055625 0.279346 3.023411
C  1.626063 -0.248272 1.813213
C  1.183417 0.320077 4.096941
C  0.337875 -0.734633 1.658812
C  -0.099694 -0.196136 3.982924
C  -0.517659 -0.741163 2.774588
C  -1.475985 -0.720747 -0.141064
C  -2.444258 -1.639314 -0.699137
C  -1.811296 0.583235 -0.151216
N  -3.639645 -1.098452 -1.091272
N  -3.009774 1.03299 -0.590422
C  -3.989957 0.21499 -1.058235
N  1.855143 -2.87728 -2.370383
C  2.593459 -1.863493 -2.902538
C  0.993125 -2.700452 -1.347096
N  2.323624 -0.649375 -2.354716
C  0.776233 -1.508653 -0.74892
C  1.427289 -0.370597 -1.355672
H  0.32514 -4.633409 -1.627521
H  -0.772933 -3.595991 -0.856641
H  0.061458 1.358122 -0.139963
H  -1.16236 2.534749 -0.032706
H  -0.522733 -2.340636 0.685887
H  3.066659 0.656808 3.118118
H  2.323959 -0.28353 0.986952
H  -0.762271 -0.184633 4.838094
O  -1.720493 -1.318669 2.586909
H  2.806208 0.146013 -2.75991
H  1.983445 -3.80082 -2.772784
H  -3.215795 2.02696 -0.562908
H  -4.331629 -1.741782 -1.461182
H  -0.803404 1.631766 1.307088
H  0.577562 -4.234419 -0.043415
C  -2.638922 -1.332153 3.666612
H  -3.532764 -1.829658 3.294017
H  -2.894342 -0.316098 3.980366
H  -2.240731 -1.891475 4.517724
elementType: S H N O C
totalener: -1969.48426009 hartree
nucrepener: 2961.80997543 hartree
electener: -4931.29423552 hartree
oneelecener: -8534.11832328 hartree
twoeener: 3602.82408776 hartree
cpcmener: -0.35938646 hartree
kineticenergy: 1961.88410494 hartree
exchangeener: -152.180064214979 hartree
correlationener: -7.346469289488 hartree
xcener: -159.526533504468 hartree
chargesum: 2.0000000
charge: -0.214078 -0.238821 -0.673049 -0.650940 -0.690523 -0.989832 -0.980965 0.329188 -0.221261 1.588492 -0.019739 1.261047 0.990270 0.584513 0.785429 0.282901 1.443605 -0.497734 -0.481229 0.408333 -0.447009 0.411297 1.037238 -0.476750 0.772432 0.731053 0.287764 0.256211 0.272856 0.296295 -0.567143 -0.789145 -1.037249 -1.108303 -0.934361 0.039148 0.004553 -0.010416 0.048327 0.352653 0.362350 1.143889 -0.415719 -0.089112 -0.156466
charge: 0.566214 0.556746 0.020793 0.536510 0.530518 0.175447 0.164298 -0.072506 0.010430 0.051621 0.010957 -0.110554 0.055385 -0.195746 -0.012590 -0.262166 -0.069386 0.183030 0.184998 -0.691850 0.187173 -0.689513 -0.057981 0.184761 0.002622 -0.268574 0.119895 -0.045251 -0.060903 0.120080 0.044771 0.016277 0.014792 0.009732 0.125917 0.064454 0.076553 0.074616 0.063461 0.109750 0.133574 0.151542 -0.008888 0.000432 -0.001440
qa: -0.2141 -0.2388 -0.6730 -0.6509 -0.6905 -0.9898 -0.9810 0.3292 -0.2213 1.5885 -0.0197 1.2610 0.9903 0.5845 0.7854 0.2829 1.4436 -0.4977 -0.4812 0.4083 -0.4470 0.4113 1.0372 -0.4767 0.7724 0.7311 0.2878 0.2562 0.2729 0.2963 -0.5671 -0.7891 -1.0372 -1.1083 -0.9344 0.0391 0.0046 -0.0104 0.0483 0.3527 0.3624 1.1439 -0.4157 -0.0891 -0.1565
va: 1.7973 1.7768 0.4196 2.8107 3.0120 1.4077 1.4075 3.2943 2.1924 -3.0594 4.6070 5.6743 -0.0251 -0.1215 1.4272 0.4040 -6.8989 2.7314 2.6168 3.1519 2.7066 3.1847 -6.0072 2.8885 2.2000 1.1007 0.7286 0.9893 0.8897 0.7145 0.5582 0.3551 -0.6058 -0.5121 1.1750 0.8592 0.8543 0.8678 0.8549 0.7708 0.7788 3.3658 0.4779 0.6558 0.6275
energy: 29078.8 29746.1 30086.0 31611.9 32053.1 33459.3 33634.5 33992.5 34643.1 35459.9 36025.9 36104.4 36135.2 36457.9 37159.8 38206.2 38659.8 39630.3 40377.0 40713.5 41330.8 41421.2 41603.0 42200.1 43471.4 43912.3 44679.2 44719.4 45077.6 45170.2 46553.2 46970.3 47297.0 47399.8 47515.0 47790.5 47990.8 48109.8 48171.8 48866.3 49132.7 49181.9 49271.2 49353.5 49700.6 49864.6 50217.6 50271.5 50677.5 51020.4 51214.3 51339.0 51482.2 51628.5 51651.3 51747.1 51834.5 51922.4 52082.7 52359.2 52403.9 52448.2 52557.8 52691.6 52734.4 52794.6 53097.7 53265.0 53325.8 53603.5 53683.1 54002.6 54022.9 54116.0 54221.7 54266.9 54313.1 54424.4 54509.5 54704.6 54809.2 54921.7 55027.3 55230.6 55433.0 55686.5 55841.4 55999.4 56019.5 56097.6 56209.2 56394.2 56526.2 56647.8 56710.0 56789.7 56837.5 56915.2 57029.1 57055.3 57251.8 57282.8 57411.7 57454.8 57480.9 57668.3 57849.8 57921.4 58028.8 58058.7 58075.5 58100.9 58215.7 58489.9 58548.9 58602.1 58627.0 58758.7 58780.1 58870.6 59040.3 59241.5 59266.6 59316.0 59341.5 59433.1 59615.6 59639.7 59822.2 59902.1 60069.0 60273.1 60313.4 60419.0 60534.5 60629.6 60708.3 60724.7 60767.1 60805.3 60963.0 61006.7 61053.5 61090.9 61229.5 61323.6 61460.9 61555.3 61595.2 61648.4 61659.6 61691.1 61803.8 61889.5 62031.1 62112.2 62169.3 62241.4 62244.7 62277.3 62349.1 62415.8 62500.2 62579.7 62702.9 62795.5 62881.9 62952.8 63006.1 63094.2 63199.3 63241.6 63263.8 63346.5 63413.7 63546.2 63567.0 63616.2 63658.2 63700.0 63785.5 63869.7 63946.8 63948.1 64089.4 64180.9 64318.2 64375.9 64393.5 64453.6 64510.1 64568.1 64598.7 64642.6 64676.1 64706.2 64780.5 64795.6 64867.4 64908.5
energy: -1969.414933793398
dipole: 0.27842 0.19288 0.47130 -0.75682 -0.77843 -1.53525 20.54274 -18.79003 1.75272
magnitude: 2.37721 au
magnitude: 6.04239 debye
