program: Orca
programVersion: 5.0.4
elementType: S S H N N O O C C C C C C C C C C N N C N C C N C C H H H H H H H H O H H H H H H C H H H
keywords: PBE0 ma-def2-TZVP AutoAux D4 VeryTightSCF TightOPT
charge: 2
multiplicity: 1
formula: C16H18N6O3S2
InChI: InChI=1/C16H18N6O3S2/c1-25-7-5-3-2-4-6(7)8(9-11(17)19-15(26)21-13(9)23)10-12(18)20-16(27)22-14(10)24/h2-5,8,19-24H,17-18H2,1H3
45 atoms
S  3.445334 -2.381826 -4.343714
S  -5.410662 1.44381 -1.363593
H  1.35745 0.022308 5.110485
N  1.559916 -3.453853 0.086448
N  -0.774696 1.580697 0.338987
O  0.473229 0.67276 -2.061974
O  -2.790012 -2.589063 -0.870745
C  -0.31642 -1.332035 0.179913
C  1.822936 0.093807 3.018993
C  1.401239 -0.264994 1.74758
C  1.040003 -0.248645 4.110669
C  0.201326 -0.943359 1.554049
C  -0.1447 -0.951415 3.946861
C  -0.56995 -1.305279 2.671567
C  -1.593156 -0.607422 -0.204604
C  -2.706819 -1.299151 -0.679407
C  -1.784527 0.769181 -0.05594
N  -3.840564 -0.666886 -1.012277
N  -2.946552 1.346951 -0.402235
C  -4.053924 0.695395 -0.928087
N  2.386998 -2.811089 -1.954982
C  2.525354 -2.004419 -3.075665
C  1.576624 -2.569259 -0.907879
N  1.816376 -0.829504 -2.941273
C  0.752035 -1.421688 -0.895775
C  0.98969 -0.521796 -1.924926
H  2.159587 -4.264346 0.073744
H  -2.017042 -3.068649 -0.548065
H  0.121536 1.049849 -1.229737
H  -0.974959 2.558675 0.500323
H  -0.636881 -2.372826 0.323368
H  2.757248 0.623172 3.155628
H  2.021501 -0.022492 0.889334
H  -0.728259 -1.221004 4.816724
O  -1.693805 -1.999994 2.403552
H  1.950524 -0.140689 -3.672981
H  2.973365 -3.636732 -1.974288
H  -3.077752 2.345996 -0.29702
H  -4.616108 -1.219145 -1.363077
H  -0.112537 1.175067 1.000638
H  1.208436 -3.176353 0.990207
C  -2.501809 -2.427167 3.498971
H  -3.332969 -2.976214 3.063436
H  -2.883541 -1.569594 4.057307
H  -1.939934 -3.086149 4.164301
totalener: -1969.27475641 hartree
nucrepener: 2972.20493750 hartree
electener: -4941.47969391 hartree
oneelecener: -8557.60188687 hartree
twoeener: 3616.12219296 hartree
kineticenergy: 1965.40780866 hartree
exchangeener: -152.590394880132 hartree
correlationener: -7.361906903756 hartree
xcener: -159.952301783889 hartree
chargesum: 2.0000000
charge: -0.163292 -0.152759 0.181793 -0.424135 -0.431837 -0.246874 -0.238192 3.485123 -0.392694 0.647756 0.360629 -0.599155 -0.353440 0.119257 -3.191366 0.235512 0.920248 -0.180519 -0.174508 -0.071072 -0.137573 -0.038936 0.376959 -0.153899 -1.814820 0.631909 0.295224 0.365132 0.400859 0.298657 0.138957 0.176440 0.191396 0.196676 -0.328924 0.308984 0.283249 0.284848 0.311747 0.328940 0.321419 -0.320658 0.180707 0.185161 0.187072
charge: 0.470762 0.483427 0.197441 0.043501 0.001131 0.129827 0.159434 -0.169381 -0.143081 -0.162572 -0.106007 -0.192356 -0.117378 -0.262926 -0.119536 -0.265940 -0.257343 0.164797 0.143696 -0.623379 0.139086 -0.625779 -0.245838 0.155944 -0.128671 -0.288593 0.228633 0.249312 0.240679 0.229699 0.231999 0.194599 0.208297 0.203618 0.090923 0.273654 0.262624 0.264147 0.276084 0.241051 0.234518 -0.288397 0.159232 0.159251 0.159809
qa: -0.1633 -0.1528 0.1818 -0.4241 -0.4318 -0.2469 -0.2382 3.4851 -0.3927 0.6478 0.3606 -0.5992 -0.3534 0.1193 -3.1914 0.2355 0.9202 -0.1805 -0.1745 -0.0711 -0.1376 -0.0389 0.3770 -0.1539 -1.8148 0.6319 0.2952 0.3651 0.4009 0.2987 0.1390 0.1764 0.1914 0.1967 -0.3289 0.3090 0.2832 0.2848 0.3117 0.3289 0.3214 -0.3207 0.1807 0.1852 0.1871
va: 2.1270 2.1416 0.9507 3.1455 2.9769 2.2857 2.3359 -14.5974 4.0963 2.4428 3.0962 3.7251 4.6891 3.8536 -4.2491 3.8632 1.9713 3.1466 3.2569 4.3973 3.1180 4.3758 3.9277 3.2527 3.3650 3.2942 0.9303 0.8975 0.8495 0.9316 0.9065 0.9540 0.9380 0.9520 2.0383 0.9186 0.9367 0.9368 0.9192 0.9295 0.9143 3.8412 0.9547 0.9456 0.9458
energy: -1969.545449171768
dipole: 2.83298 -2.34661 0.48637 -3.23145 2.71718 -0.51427 22.57622 -20.83244 1.74378
magnitude: 1.88197 au
magnitude: 4.78359 debye
