program: Orca
programVersion: 5.0.4
elementType: S S H N N O O C C C C C C C C C C N N C N C C N C C H H H H H H H H H H H H O C H H H
keywords: PBE0 aug-cc-pVDZ AutoAux D4 VeryTightSCF
charge: 0
multiplicity: 1
formula: C16H16N6O3S2
InChI: InChI=1/C16H16N6O3S2/c1-25-7-5-3-2-4-6(7)8(9-11(17)19-15(26)21-13(9)23)10-12(18)20-16(27)22-14(10)24/h2-5,8,19-22H,17-18H2,1H3
43 atoms
S  -4.13919 -4.32037 -1.8389
S  5.53607 -1.60511 -1.95154
H  -1.09342 3.99408 2.29478
N  -1.00972 -0.53651 -2.02202
N  1.91012 -3.27186 0.92056
O  -1.00128 -3.35802 1.79594
O  1.36599 0.88133 -1.32493
C  0.17446 -0.99877 0.67432
C  -1.77597 2.24741 1.24884
C  -1.43984 0.96681 0.82464
C  -0.85209 2.99204 1.95821
C  -0.19643 0.41435 1.08311
C  0.39347 2.45532 2.25895
C  0.71623 1.1721 1.83619
C  1.47923 -1.12974 -0.08198
C  1.96625 -0.1473 -0.96576
C  2.25612 -2.25453 0.13403
N  3.2405 -0.35493 -1.49085
N  3.47913 -2.36553 -0.47263
C  4.02332 -1.42662 -1.27801
N  -2.40507 -2.32595 -1.76384
C  -2.94282 -3.39768 -1.1399
C  -1.42051 -1.52657 -1.2401
N  -2.42731 -3.65413 0.07589
C  -0.93239 -1.79018 0.02873
C  -1.41561 -2.93351 0.70392
H  -2.7638 -2.11813 -2.68731
H  4.03615 -3.19313 -0.30378
H  -1.40344 -0.42085 -2.94227
H  -0.26859 0.09923 -1.72907
H  0.98958 -3.32285 1.34176
H  2.52076 -4.0680 1.01764
H  -2.77986 -4.46286 0.5711
H  3.59171 0.36184 -2.11232
H  0.34812 -1.5014 1.63164
H  -2.75593 2.65164 1.02394
H  -2.17429 0.38484 0.28147
H  1.10322 3.0372 2.83141
O  1.89605 0.57266 2.12907
C  2.85025 1.30566 2.8749
H  3.71193 0.64952 2.98613
H  3.15235 2.21402 2.34616
H  2.46499 1.56886 3.86409
elementType: S H N O C
totalener: -1968.63330575 hartree
nucrepener: 2897.83067455 hartree
electener: -4866.46398030 hartree
oneelecener: -8461.02038185 hartree
twoeener: 3594.55640155 hartree
cpcmener: -0.07751798 hartree
kineticenergy: 1961.24810876 hartree
exchangeener: -152.062655716278 hartree
correlationener: -7.343227781324 hartree
xcener: -159.405883497601 hartree
chargesum: -0.0000000
charge: -0.318961 -0.328257 -0.668524 -0.125051 -0.224002 -0.956218 -1.082386 0.588596 -0.241668 1.478959 -0.075715 1.749125 1.141941 0.131274 0.964494 1.018183 0.392167 -0.500622 -0.487099 0.403479 -0.304584 0.472881 -0.365723 -0.507893 1.102496 0.866674 -0.009937 0.012691 -0.092260 0.097258 0.004494 -0.046293 0.018534 0.005333 -0.630720 -0.797894 -1.063166 -1.122814 -1.006979 1.147691 -0.419062 -0.088221 -0.132220
charge: 0.476158 0.473000 0.014729 0.381223 0.380247 0.049845 0.070835 -0.088030 -0.004946 0.039675 -0.006186 -0.108437 0.039324 -0.198659 -0.055211 -0.344599 -0.173511 0.158373 0.169360 -0.716679 0.170020 -0.715167 -0.186751 0.156254 -0.053708 -0.347356 0.054937 0.055363 0.037809 -0.084153 -0.063482 0.037134 0.046488 0.046179 0.034088 0.010695 0.009166 0.002574 0.111922 0.138015 -0.011105 -0.002078 -0.003353
qa: -0.3190 -0.3283 -0.6685 -0.1251 -0.2240 -0.9562 -1.0824 0.5886 -0.2417 1.4790 -0.0757 1.7491 1.1419 0.1313 0.9645 1.0182 0.3922 -0.5006 -0.4871 0.4035 -0.3046 0.4729 -0.3657 -0.5079 1.1025 0.8667 -0.0099 0.0127 -0.0923 0.0973 0.0045 -0.0463 0.0185 0.0053 -0.6307 -0.7979 -1.0632 -1.1228 -1.0070 1.1477 -0.4191 -0.0882 -0.1322
va: 1.6891 1.6845 0.4305 3.0457 2.9999 1.2404 1.3931 1.1622 2.1390 -3.4557 4.5994 4.8028 -0.0517 -0.0782 1.5198 1.1481 -2.4270 3.0303 2.7845 3.0721 2.6681 3.0606 1.0255 2.8967 2.4471 -1.0344 0.8408 0.8364 0.8657 0.7390 0.9039 0.8343 0.8635 0.8709 0.5446 0.3515 -0.6921 -0.5738 1.1096 3.3636 0.4551 0.6606 0.6428
energy: 33270.5 33394.2 34636.6 36780.9 37202.0 37807.6 37958.5 38585.6 39047.6 39128.6 39867.1 40316.8 40622.4 40988.8 41228.7 41259.1 41414.5 41817.5 42250.8 42380.8 42671.0 43270.6 43465.1 44022.3 44339.6 44419.9 44535.6 44930.0 45032.1 45122.1 45291.8 45410.5 45574.4 45639.3 46115.3 46287.3 46357.4 46462.3 46631.1 46709.6 47046.9 47214.3 47423.8 47510.6 47633.6 47797.7 47922.3 48027.3 48268.4 48649.5 48678.4 48706.3 48849.3 48933.9 49212.9 49656.5 49661.7 49834.3 49875.9 50175.5 50269.1 50413.9 50505.5 50579.5 50669.2 50749.3 50819.0 50931.9 51085.9 51112.2 51155.8 51241.6 51331.4 51385.8 51418.9 51630.5 51793.1 51868.1 51965.6 52055.0 52113.4 52283.7 52331.0 52460.6 52572.4 52666.1 52871.8 53297.5 53374.2 53437.1 53683.8 53722.8 53760.1 53804.9 53957.6 54142.6 54223.4 54316.3 54397.2 54411.9 54558.8 54588.9 54609.8 54691.1 54755.5 54817.4 54897.8 54965.8 55053.2 55090.4 55135.6 55188.3 55253.5 55339.5 55413.5 55432.7 55533.7 55578.8 55617.5 55629.6 55771.7 55938.5 56024.3 56123.7 56162.2 56175.6 56214.9 56350.7 56394.8 56516.3 56665.7 56719.3 56814.7 56932.1 57038.6 57057.5 57086.3 57272.8 57292.4 57398.4 57487.3 57498.9 57742.4 57993.0 58048.9 58112.4 58199.5 58314.4 58357.7 58474.9 58585.9 58600.9 58669.3 58752.7 58861.6 58868.3 58900.9 59000.0 59007.8 59236.0 59254.5 59326.8 59461.8 59483.2 59543.8 59585.0 59660.9 59676.3 59752.4 59786.7 59825.2 59882.9 60020.1 60033.0 60168.8 60227.5 60297.7 60334.9 60339.6 60378.0 60437.7 60503.7 60643.3 60713.0 60892.0 60933.0 60950.0 60981.6 61029.8 61237.3 61291.2 61363.7 61508.5 61537.5 61620.9 61716.1 61724.1 61859.2 61980.8 62032.2
energy: -1968.545006833399
dipole: 2.07964 -1.39927 0.68037 12.86905 -12.63169 0.23736 10.96589 -10.60658 0.35931
magnitude: 0.80520 au
magnitude: 2.04665 debye
