program: Orca
programVersion: 5.0.4
elementType: S S H N N O O C C C C C C C C C C N N C N C C N C C H H H H H H O H H C H H H
keywords: PBE0 ma-def2-TZVP AutoAux D4 VeryTightSCF TightOPT
charge: -4
multiplicity: 1
formula: C16H12N6O3S2
InChI: InChI=1/C16H12N6O3S2/c1-25-7-5-3-2-4-6(7)8(9-11(17)19-15(26)21-13(9)23)10-12(18)20-16(27)22-14(10)24/h2-5,8H,17-18H2,1H3
39 atoms
S  3.596157 -1.270248 -4.226477
S  -5.775954 0.09312 -1.202763
H  1.522968 0.357321 5.222322
N  -0.002572 -3.414809 -1.610262
N  -1.080837 1.317345 -0.332777
O  1.700735 0.79822 -0.183937
O  -2.406841 -3.222104 0.173078
C  -0.2078 -1.414799 0.406698
C  1.939138 -0.880267 3.523149
C  1.495812 -1.329811 2.285218
C  1.167262 0.013557 4.25666
C  0.281594 -0.874809 1.738856
C  -0.0473 0.444398 3.757272
C  -0.474236 -0.008297 2.513018
C  -1.613607 -1.001686 0.028678
C  -2.638002 -1.980617 -0.063746
C  -1.972734 0.291023 -0.353873
N  -3.896761 -1.623217 -0.428843
N  -3.22009 0.62501 -0.733796
C  -4.144798 -0.346826 -0.741742
N  1.636625 -2.306296 -2.763295
C  2.485838 -1.272383 -2.870507
C  0.801079 -2.306801 -1.711425
N  2.528143 -0.248867 -2.012588
C  0.763419 -1.293557 -0.756583
C  1.667504 -0.223124 -0.961551
H  -0.067051 -3.962701 -2.453466
H  -0.850705 -3.367982 -1.051407
H  -0.078812 1.143718 -0.233508
H  -1.366794 2.160327 -0.802465
H  -0.28655 -2.491546 0.594909
H  2.879636 -1.228584 3.929732
O  2.185334 -2.235391 1.547732
H  -0.666701 1.129661 4.325846
H  -1.429217 0.325459 2.126473
C  3.415241 -2.713029 2.050575
H  3.794726 -3.411087 1.304851
H  3.284561 -3.239805 3.001622
H  4.137193 -1.900515 2.180542
totalener: -1966.80774484 hartree
nucrepener: 2815.86509484 hartree
electener: -4782.67283968 hartree
oneelecener: -8397.29616635 hartree
twoeener: 3614.62332667 hartree
cpcmener: -0.89989403 hartree
kineticenergy: 1962.28367371 hartree
exchangeener: -151.928880731494 hartree
correlationener: -7.336632011696 hartree
xcener: -159.265512743190 hartree
elementType: S H N O C
chargesum: -4.0000000
charge: -0.932907 -0.935482 0.168954 -0.708609 -0.600406 -0.879164 -0.871836 0.768872 -0.359061 0.466504 0.127660 -1.376372 -0.387842 0.567484 -1.449929 0.313348 0.422132 -0.746346 -0.690132 0.386006 -0.719460 0.470101 -0.217162 -0.714504 1.968619 0.259220 0.289286 0.287978 0.300549 0.287768 0.118194 0.194013 -0.332700 0.164626 0.194469 -0.356018 0.178007 0.169779 0.174360
charge: -0.207837 -0.205512 0.184247 -0.102768 -0.085492 -0.257918 -0.291812 -0.170957 -0.175997 -0.256367 -0.191105 -0.123406 -0.203654 -0.145920 -0.177955 -0.463841 -0.359305 -0.084383 -0.077108 -0.688235 -0.076094 -0.688263 -0.348345 -0.075813 -0.165785 -0.462143 0.210064 0.209393 0.215029 0.210900 0.236869 0.197689 0.090669 0.183452 0.209561 -0.328490 0.156422 0.153774 0.156436
qa: -0.9329 -0.9355 0.1690 -0.7086 -0.6004 -0.8792 -0.8718 0.7689 -0.3591 0.4665 0.1277 -1.3764 -0.3878 0.5675 -1.4499 0.3133 0.4221 -0.7463 -0.6901 0.3860 -0.7195 0.4701 -0.2172 -0.7145 1.9686 0.2592 0.2893 0.2880 0.3005 0.2878 0.1182 0.1940 -0.3327 0.1646 0.1945 -0.3560 0.1780 0.1698 0.1744
va: 1.1067 1.1040 0.9532 2.9819 2.8083 1.5424 1.4317 1.0237 4.6820 3.0315 3.4292 3.2712 4.1109 2.6727 2.1715 3.8225 3.5907 2.7083 2.6292 3.6958 2.6369 3.4731 4.4019 2.6586 -3.0285 4.0754 0.9331 0.9388 0.9357 0.9345 0.9886 0.9531 1.9363 0.9576 0.9310 3.8563 0.9475 0.9476 0.9493
energy: -1967.031792385048
dipole: 11.86151 -6.60717 5.25434 -2.81412 1.83002 -0.98410 19.53228 -9.65782 9.87446
magnitude: 11.22860 au
magnitude: 28.54084 debye
