program: Orca
programVersion: 5.0.4
elementType: S S C N N O O C C C C C C C C C C N N C N C C N C C H H H H H H H H H H H H H H H H
keywords: PBE0 ma-def2-TZVP AutoAux D4 VeryTightSCF TightOPT
charge: 0
multiplicity: 1
formula: C16H16N6O2S2
InChI: InChI=1/C16H16N6O2S2/c1-6-2-4-7(5-3-6)8(9-11(17)19-15(25)21-13(9)23)10-12(18)20-16(26)22-14(10)24/h2-5,8,19-22H,17-18H2,1H3
42 atoms
S  4.209849 -4.097015 -2.124281
S  -5.777803 -1.525142 -1.340786
C  1.247962 4.258098 2.627619
N  1.132302 -0.262042 -1.883072
N  -1.976879 -3.223434 1.293822
O  0.874926 -3.644378 1.437121
O  -1.412868 0.681911 -1.359988
C  -0.144336 -1.076936 0.690735
C  1.871875 2.040767 1.608362
C  1.542803 0.780425 1.123584
C  0.901649 2.893421 2.119675
C  0.229525 0.332852 1.127682
C  -0.414637 2.431772 2.141507
C  -0.74335 1.178205 1.657818
C  -1.526501 -1.191746 0.090836
C  -2.030231 -0.256983 -0.846647
C  -2.346651 -2.240734 0.470219
N  -3.366678 -0.417387 -1.220065
N  -3.634482 -2.302591 0.005062
C  -4.19379 -1.400683 -0.830713
N  2.481646 -2.113959 -1.844817
C  2.971077 -3.27701 -1.363878
C  1.477615 -1.383283 -1.259798
N  2.374181 -3.713808 -0.24186
C  0.920455 -1.822492 -0.07127
C  1.341799 -3.073465 0.443874
H  2.894347 -1.77293 -2.704152
H  -4.219672 -3.077904 0.288553
H  1.529268 -0.049189 -2.785033
H  0.265095 0.217889 -1.618815
H  -0.986104 -3.387921 1.475609
H  -2.61221 -3.986542 1.472827
H  2.689689 -4.595827 0.140345
H  -3.73282 0.264289 -1.871792
H  -0.200189 -1.620194 1.639805
H  2.908281 2.363627 1.586042
H  2.331473 0.141322 0.743949
H  -1.196811 3.068846 2.544062
H  -1.777817 0.852635 1.690654
H  2.324827 4.432383 2.589777
H  0.91807 4.393463 3.661697
H  0.760385 5.036949 2.033343
totalener: -1893.76299921 hartree
nucrepener: 2655.79959299 hartree
electener: -4549.56259220 hartree
oneelecener: -7875.25138463 hartree
twoeener: 3325.68879243 hartree
cpcmener: -0.05456268 hartree
kineticenergy: 1887.76256769 hartree
exchangeener: -145.965075165716 hartree
correlationener: -7.048359142461 hartree
xcener: -153.013434308177 hartree
elementType: S C N O H
chargesum: -0.0000000
charge: -0.570218 -0.569006 -0.493022 -0.495483 -0.599063 -0.593120 -0.521002 -0.830032 0.076406 -0.190097 0.103922 -0.330517 -0.151986 -0.217813 0.866650 0.341673 0.222804 -0.184000 -0.164235 0.183393 -0.171263 0.168825 0.304053 -0.212698 -0.128113 0.203227 0.322915 0.321384 0.324773 0.320117 0.313489 0.328285 0.316463 0.318255 0.158047 0.170751 0.195345 0.171404 0.191359 0.166666 0.165304 0.166158
charge: 0.133529 0.134176 -0.295453 0.016677 0.006693 -0.066182 -0.043432 -0.152822 -0.155417 -0.137193 -0.235964 -0.158783 -0.150089 -0.125994 -0.133481 -0.383792 -0.258112 0.126638 0.130485 -0.614571 0.128996 -0.613981 -0.268610 0.125823 -0.137945 -0.382340 0.268445 0.267967 0.230898 0.229062 0.223392 0.230284 0.265912 0.266451 0.243687 0.192142 0.208145 0.193730 0.207459 0.159725 0.161748 0.162097
qa: -0.5702 -0.5690 -0.4930 -0.4955 -0.5991 -0.5931 -0.5210 -0.8300 0.0764 -0.1901 0.1039 -0.3305 -0.1520 -0.2178 0.8667 0.3417 0.2228 -0.1840 -0.1642 0.1834 -0.1713 0.1688 0.3041 -0.2127 -0.1281 0.2032 0.3229 0.3214 0.3248 0.3201 0.3135 0.3283 0.3165 0.3183 0.1580 0.1708 0.1953 0.1714 0.1914 0.1667 0.1653 0.1662
va: 1.6416 1.6441 3.9454 2.9176 3.0959 1.8077 1.7909 3.5304 3.5766 4.1506 3.6453 5.1099 4.1643 4.1830 0.7016 4.1682 4.1262 3.2119 3.1934 4.0186 3.2106 4.0626 4.0730 3.2266 3.5910 4.1316 0.9042 0.9039 0.9095 0.9529 0.9429 0.9088 0.9086 0.9063 0.9544 0.9518 0.9380 0.9523 0.9317 0.9547 0.9491 0.9491
energy: -1893.826448013388
dipole: 5.10711 -5.19707 -0.08996 18.25726 -17.91878 0.33848 11.70546 -11.27337 0.43209
magnitude: 0.55620 au
magnitude: 1.41375 debye
