program: Orca
programVersion: 5.0.4
elementType: S S C N N O O C C C C C C C C C C N N C N C C N C C H H H H H H H H H H H H
keywords: PBE0 aug-cc-pVDZ AutoAux D4 VeryTightSCF
charge: -4
multiplicity: 1
formula: C16H12N6O2S2
InChI: InChI=1/C16H12N6O2S2/c1-6-2-4-7(5-3-6)8(9-11(17)19-15(25)21-13(9)23)10-12(18)20-16(26)22-14(10)24/h2-5,8H,17-18H2,1H3
38 atoms
S  3.845422 -1.486499 -4.089638
S  -5.837804 -0.019319 -1.031732
C  1.815494 0.480855 5.532067
N  0.186281 -3.531961 -1.483411
N  -1.16643 1.358783 -0.228016
O  1.580226 0.9046 -0.439947
O  -2.297172 -3.255039 0.058748
C  -0.172196 -1.376455 0.35453
C  2.130731 -0.626708 3.291592
C  1.660674 -1.036755 2.057035
C  1.300513 0.033313 4.198953
C  0.339369 -0.810029 1.668063
C  -0.015956 0.253827 3.815179
C  -0.488794 -0.162474 2.574699
C  -1.590794 -0.999471 -0.010061
C  -2.579111 -2.013699 -0.119457
C  -2.017428 0.297049 -0.295258
N  -3.861436 -1.690851 -0.429484
N  -3.289883 0.598988 -0.614728
C  -4.172976 -0.410221 -0.655118
N  1.840084 -2.462757 -2.651758
C  2.638369 -1.397072 -2.824202
C  0.951269 -2.405546 -1.646394
N  2.562028 -0.27974 -2.09589
C  0.820916 -1.310656 -0.791738
C  1.650931 -0.198659 -1.090271
H  0.206108 -4.164474 -2.267692
H  -0.7046 -3.461829 -0.992338
H  -0.153712 1.196763 -0.25724
H  -1.504658 2.202734 -0.662236
H  -0.254155 -2.444393 0.58597
H  3.165967 -0.820851 3.559489
H  2.333472 -1.54291 1.371548
H  -0.691768 0.761143 4.498057
H  -1.524748 0.020307 2.311874
H  2.199974 -0.361956 6.114974
H  1.03005 0.962627 6.118018
H  2.638764 1.193992 5.423901
elementType: S C N O H
totalener: -1891.55064139 hartree
nucrepener: 2543.40154847 hartree
electener: -4434.95218987 hartree
oneelecener: -7745.53896902 hartree
twoeener: 3310.58677915 hartree
cpcmener: -0.89821323 hartree
kineticenergy: 1884.30472648 hartree
exchangeener: -145.412110172404 hartree
correlationener: -7.041823807877 hartree
xcener: -152.453933980281 hartree
chargesum: -4.0000000
charge: -0.655821 -0.657846 0.731654 -0.225538 -0.162324 -1.221998 -1.155529 0.980464 -0.060472 1.197089 0.112829 1.208109 -0.544083 0.937384 0.151026 0.854061 0.315147 -0.826809 -0.764857 -0.025573 -0.726025 0.026620 0.172300 -0.840279 1.117672 1.004593 -0.029905 -0.134026 -0.077530 -0.062730 -0.456345 -0.908698 -1.072242 -0.914480 -1.050446 0.041519 -0.322415 0.045506
charge: 0.052109 0.051382 0.161309 0.286759 0.291279 -0.067835 -0.094469 -0.117611 0.027195 0.032735 -0.252575 -0.153674 0.026066 0.035536 -0.106232 -0.516882 -0.358063 -0.065294 -0.034493 -0.932821 -0.035743 -0.931376 -0.348331 -0.060794 -0.097009 -0.511933 -0.023746 -0.132175 -0.148993 -0.023309 0.008941 0.018190 0.017629 0.013565 0.004459 -0.002477 -0.009313 -0.002009
qa: -0.6558 -0.6578 0.7317 -0.2255 -0.1623 -1.2220 -1.1555 0.9805 -0.0605 1.1971 0.1128 1.2081 -0.5441 0.9374 0.1510 0.8541 0.3151 -0.8268 -0.7649 -0.0256 -0.7260 0.0266 0.1723 -0.8403 1.1177 1.0046 -0.0299 -0.1340 -0.0775 -0.0627 -0.4563 -0.9087 -1.0722 -0.9145 -1.0504 0.0415 -0.3224 0.0455
va: 1.3504 1.3429 3.1249 2.9676 2.9314 1.2214 1.0991 1.4423 1.6317 -2.2930 5.6353 4.8828 3.7748 -0.9984 3.6954 -0.3994 0.7736 2.0033 1.9274 3.1133 2.0818 3.0667 -0.4737 1.7944 1.6261 0.1233 0.8611 1.0878 0.9559 0.8853 0.6312 0.1960 -0.3386 0.0066 -0.5026 0.7948 0.7161 0.7860
energy: 31644.6 31733.1 32360.6 33021.5 33727.5 33803.4 34498.4 34685.5 34952.4 35003.6 35087.4 35514.0 36115.1 36136.6 36227.5 36310.1 36647.9 36743.5 37044.3 37116.0 37444.9 37493.5 37580.1 37883.6 38348.2 38566.4 38726.0 38747.0 38862.5 38968.5 39329.4 39477.5 39548.4 39649.3 39688.4 39718.0 40297.4 40374.0 40447.8 40495.6 40571.2 40640.1 40705.3 40963.6 41354.1 41610.8 41637.3 41716.3 41753.2 41814.8 41824.7 41951.5 42028.6 42232.4 42273.5 42406.9 42428.9 42654.3 42806.9 42826.6 42942.6 42980.7 43065.9 43142.7 43199.1 43271.5 43349.7 43458.7 43653.1 43727.1 43889.7 43932.4 43975.1 44089.7 44166.7 44174.8 44218.2 44311.6 44333.5 44365.2 44430.1 44455.1 44588.8 44789.1 44880.8 44963.7 45097.5 45131.6 45187.1 45270.4 45392.7 45463.9 45560.8 45712.0 45760.8 45975.7 46027.1 46050.4 46114.7 46197.1 46360.6 46418.9 46433.9 46515.1 46608.9 46624.9 46682.5 46763.4 46829.9 46854.6 46948.2 46965.6 47083.4 47103.4 47154.3 47201.5 47262.4 47303.8 47359.3 47414.5 47494.6 47532.8 47562.5 47603.6 47644.3 47704.5 47741.6 47796.8 47857.5 47897.1 47920.4 47979.8 48083.3 48110.7 48219.8 48358.4 48436.4 48446.4 48528.4 48548.4 48661.8 48786.2 48911.0 49024.6 49041.0 49192.0 49194.9 49262.7 49287.6 49360.0 49447.9 49539.0 49588.4 49596.7 49670.1 49691.2 49744.6 49803.9 49861.4 49921.2 49981.2 50035.9 50088.5 50160.1 50210.3 50305.2 50353.9 50383.7 50419.1 50463.5 50515.2 50582.9 50741.2 50767.7 50824.4 50862.6 50920.0 50925.0 50955.0 51005.7 51076.2 51105.3 51201.6 51232.0 51293.4 51336.4 51417.7 51459.7 51568.2 51578.6 51599.1 51685.5 51698.1 51821.5 51855.6 51975.3 52048.1 52082.5 52156.8 52259.9
energy: -1891.469112585469
dipole: 9.09014 -5.49103 3.59911 3.19938 -2.43071 0.76866 25.96519 -15.95955 10.00564
magnitude: 10.66102 au
magnitude: 27.09816 debye
