program: Orca
programVersion: 5.0.4
elementType: S S C N N O O C C C C C C C C C C N N C N C C N C C H H H H H H H H H H H H H H H H H H
keywords: PBE0 ma-def2-TZVP AutoAux D4 VeryTightSCF TightOPT
charge: 2
multiplicity: 1
formula: C16H18N6O2S2
InChI: InChI=1/C16H18N6O2S2/c1-6-2-4-7(5-3-6)8(9-11(17)19-15(25)21-13(9)23)10-12(18)20-16(26)22-14(10)24/h2-5,8,19-22H,1,17-18H3
44 atoms
S  3.615426 -1.769496 -4.182849
S  -5.587184 0.501516 -1.430094
C  1.81245 0.647298 5.447637
N  0.336012 -3.882366 -1.05917
N  -1.055254 1.456918 0.432892
O  1.131486 0.82967 -0.879393
O  -2.204124 -2.991624 -0.892767
C  -0.226216 -1.439032 0.401803
C  2.160282 -0.134609 3.080806
C  1.685091 -0.610589 1.866387
C  1.3033 0.118625 4.144917
C  0.330398 -0.842583 1.681721
C  -0.055026 -0.136269 3.958164
C  -0.534181 -0.615394 2.751976
C  -1.538801 -0.869596 -0.074734
C  -2.458816 -1.804983 -0.685606
C  -1.932251 0.419756 -0.036389
N  -3.678644 -1.303201 -1.05539
N  -3.149419 0.830842 -0.456891
C  -4.091114 -0.011223 -0.962527
N  1.859218 -2.735006 -2.454543
C  2.541045 -1.659269 -2.937928
C  1.006242 -2.6565 -1.411934
N  2.24009 -0.493962 -2.30621
C  0.737877 -1.510629 -0.750884
C  1.352257 -0.313886 -1.277426
H  0.451921 -4.613968 -1.76791
H  -0.700055 -3.67025 -0.949853
H  -0.086041 1.26816 0.017582
H  -1.360358 2.390226 0.13683
H  -0.476059 -2.464963 0.68193
H  3.224733 0.03958 3.199663
H  2.396779 -0.81084 1.073924
H  -0.749461 0.03359 4.774805
H  -1.594918 -0.822177 2.647586
H  2.688775 0.342685 -2.66422
H  2.026921 -3.626347 -2.911274
H  -3.402742 1.812094 -0.389971
H  -4.334246 -1.958999 -1.467111
H  -0.981862 1.461455 1.459002
H  0.690178 -4.262461 -0.171612
H  2.903249 0.655798 5.472281
H  1.453587 0.044118 6.285778
H  1.463467 1.670462 5.617612
totalener: -1894.60676125 hartree
nucrepener: 2724.51859858 hartree
electener: -4619.12535983 hartree
oneelecener: -7959.65105510 hartree
twoeener: 3340.52569527 hartree
cpcmener: -0.36395267 hartree
kineticenergy: 1888.23725500 hartree
exchangeener: -146.063011918537 hartree
correlationener: -7.048169402093 hartree
xcener: -153.111181320629 hartree
elementType: S C N O H
chargesum: 2.0000000
charge: -0.464531 -0.471693 -0.489211 -0.396771 -0.370849 -0.436059 -0.478438 -1.676542 0.028611 -0.495542 0.108368 -0.040925 -0.048127 -0.165630 1.327219 -0.009342 0.042812 -0.154475 -0.153925 0.148027 -0.117933 0.178513 -0.025931 -0.163701 0.626657 0.516964 0.388703 0.357713 0.366552 0.388110 0.246781 0.178776 0.202680 0.180721 0.188361 0.333706 0.346496 0.345344 0.332507 0.402999 0.410459 0.170946 0.170408 0.171193
charge: 0.239217 0.233368 -0.288115 0.178010 0.170187 0.011711 -0.003399 -0.139206 -0.134902 -0.120202 -0.220408 -0.174120 -0.133104 -0.134913 -0.083008 -0.329438 -0.190006 0.159015 0.156233 -0.595281 0.158057 -0.594729 -0.179820 0.159406 -0.083662 -0.337743 0.272013 0.250257 0.248768 0.271947 0.250442 0.196263 0.212366 0.197811 0.213022 0.278379 0.280712 0.280537 0.277578 0.275321 0.280553 0.161454 0.164248 0.165179
qa: -0.4645 -0.4717 -0.4892 -0.3968 -0.3708 -0.4361 -0.4784 -1.6765 0.0286 -0.4955 0.1084 -0.0409 -0.0481 -0.1656 1.3272 -0.0093 0.0428 -0.1545 -0.1539 0.1480 -0.1179 0.1785 -0.0259 -0.1637 0.6267 0.5170 0.3887 0.3577 0.3666 0.3881 0.2468 0.1788 0.2027 0.1807 0.1884 0.3337 0.3465 0.3453 0.3325 0.4030 0.4105 0.1709 0.1704 0.1712
va: 1.7857 1.7808 3.9562 3.4254 3.4225 1.9405 1.9576 4.4120 3.6972 5.1613 3.6386 4.2824 4.0377 3.8090 1.6053 4.3013 4.3654 3.2647 3.2871 4.0885 3.2069 4.0257 4.2814 3.3403 1.9126 3.7522 0.8578 0.9303 0.9257 0.8565 0.8965 0.9495 0.9282 0.9465 0.9446 0.8967 0.8854 0.8883 0.8977 0.8291 0.8282 0.9533 0.9488 0.9490
energy: -1894.668869261181
dipole: 7.73409 -7.51359 0.22050 1.67865 -3.59106 -1.91242 24.22053 -22.84600 1.37452
magnitude: 2.36543 au
magnitude: 6.01245 debye
