program: Orca
programVersion: 5.0.4
elementType: S S C N N O O C C C C C C C C C C N N C N C C N C C H H H H H H H H H H H H
keywords: PBE0 aug-cc-pVDZ AutoAux D4 VeryTightSCF
charge: -4
multiplicity: 1
formula: C16H12N6O2S2
InChI: InChI=1/C16H12N6O2S2/c1-6-2-4-7(5-3-6)8(9-11(17)19-15(25)21-13(9)23)10-12(18)20-16(26)22-14(10)24/h2-5,8H,17-18H2,1H3
38 atoms
S  3.934025 -1.73775 -4.01291
S  -5.840635 0.252954 -0.900236
C  1.763029 0.479796 5.507323
N  0.276283 -3.691141 -1.312353
N  -1.129842 1.446616 -0.011366
O  1.472625 0.870874 -0.642038
O  -2.31832 -3.148716 -0.324328
C  -0.204003 -1.36908 0.311702
C  2.134566 -0.458053 3.193939
C  1.670009 -0.866051 1.9511
C  1.267404 0.0274 4.168225
C  0.318401 -0.80804 1.625314
C  -0.086956 0.079237 3.847646
C  -0.54902 -0.331394 2.606542
C  -1.598506 -0.915072 -0.069006
C  -2.593282 -1.91024 -0.325073
C  -2.001053 0.409353 -0.202866
N  -3.880382 -1.521904 -0.574765
N  -3.272416 0.766389 -0.47992
C  -4.169368 -0.220134 -0.623957
N  1.934203 -2.664742 -2.529239
C  2.693284 -1.584945 -2.775311
C  1.011408 -2.551525 -1.554651
N  2.5600 -0.412967 -2.1554
C  0.814473 -1.392289 -0.810992
C  1.608771 -0.264172 -1.183519
H  0.358392 -4.370996 -2.053545
H  -0.680006 -3.556219 -0.956277
H  -0.127983 1.252152 -0.181001
H  -1.471645 2.326955 -0.366097
H  -0.367788 -2.424922 0.55787
H  3.197922 -0.514655 3.410047
H  2.375791 -1.231188 1.212997
H  -0.795943 0.45008 4.583249
H  -1.610319 -0.278758 2.390428
H  2.846029 0.366108 5.587459
H  1.304394 -0.09437 6.318329
H  1.521977 1.531941 5.687801
elementType: S C N O H
totalener: -1891.53869228 hartree
nucrepener: 2541.81461265 hartree
electener: -4433.35330492 hartree
oneelecener: -7741.76696428 hartree
twoeener: 3308.41365935 hartree
cpcmener: -0.87325698 hartree
kineticenergy: 1884.26289923 hartree
exchangeener: -145.392974789775 hartree
correlationener: -7.041509536791 hartree
xcener: -152.434484326566 hartree
chargesum: -4.0000000
charge: -0.672633 -0.673617 0.737122 -0.232657 -0.234994 -1.153203 -1.093262 1.127400 -0.481554 0.701648 0.093804 1.163551 -0.087659 1.234423 0.554722 0.738442 0.357491 -0.811755 -0.778691 -0.036335 -0.759635 0.023380 0.352435 -0.851644 0.764653 0.826714 -0.018796 -0.096498 -0.060787 -0.033386 -0.447053 -0.906233 -1.062209 -0.911182 -1.033780 -0.316126 0.039940 0.037965
charge: 0.026602 0.025163 0.160604 0.272681 0.280916 0.008861 -0.012855 -0.113944 0.022899 0.035605 -0.255447 -0.145188 0.024197 0.032337 -0.105609 -0.496434 -0.369884 -0.065687 -0.046405 -0.941497 -0.047003 -0.939565 -0.360873 -0.061945 -0.102090 -0.497279 -0.035232 -0.147317 -0.151505 -0.033987 0.010165 0.012399 0.008574 0.017099 0.006762 -0.009683 -0.002869 -0.002563
qa: -0.6726 -0.6736 0.7371 -0.2327 -0.2350 -1.1532 -1.0933 1.1274 -0.4816 0.7016 0.0938 1.1636 -0.0877 1.2344 0.5547 0.7384 0.3575 -0.8118 -0.7787 -0.0363 -0.7596 0.0234 0.3524 -0.8516 0.7647 0.8267 -0.0188 -0.0965 -0.0608 -0.0334 -0.4471 -0.9062 -1.0622 -0.9112 -1.0338 -0.3161 0.0399 0.0380
va: 1.3211 1.3129 3.1364 2.8802 2.9311 1.2938 1.2079 1.5073 3.6615 -1.9415 5.4407 5.4986 1.5765 -1.9404 3.3860 0.2278 0.5826 1.9339 1.8196 3.0651 2.0292 3.0363 -1.0985 1.7347 2.1964 0.8820 0.8688 1.1091 0.9958 0.8878 0.6550 0.0056 -0.3723 0.2069 -0.3786 0.7170 0.7968 0.7924
energy: 30270.1 30562.5 31521.0 31956.7 33024.9 33101.5 33771.0 34365.2 34541.7 34753.0 34861.3 35013.5 35172.8 35555.0 35558.7 35831.4 35938.7 36078.1 36662.4 36744.9 36980.2 37042.5 37208.0 37306.3 37477.6 37557.4 37846.9 38119.8 38178.4 38349.4 38732.3 38775.7 38815.8 38904.3 39050.9 39193.9 39230.8 39365.1 39471.1 39658.9 39768.7 39916.0 40093.5 40134.7 40283.5 40306.7 40365.3 40648.0 40785.1 41009.4 41085.1 41199.9 41218.4 41280.3 41438.6 41488.5 41657.0 41842.3 41860.4 41948.0 42043.6 42141.5 42167.9 42231.4 42275.3 42465.7 42515.7 42543.0 42639.1 42805.8 42853.3 42945.1 42991.4 43046.5 43153.5 43211.2 43303.1 43359.7 43417.5 43435.6 43549.9 43612.9 43676.0 43739.4 43789.4 43913.7 44000.1 44062.8 44160.3 44232.9 44284.8 44309.6 44417.8 44561.4 44586.2 44726.0 44768.9 44818.5 44843.9 44926.1 45064.9 45203.0 45245.6 45325.2 45419.9 45493.9 45586.1 45612.5 45669.2 45687.3 45715.9 45801.5 45874.1 45894.0 45968.1 46019.0 46095.2 46139.0 46205.7 46230.1 46307.3 46367.6 46370.3 46458.3 46486.1 46498.2 46592.3 46679.9 46700.2 46754.9 46775.3 46860.1 46936.9 47018.8 47091.1 47126.8 47164.2 47212.6 47257.8 47304.1 47351.5 47423.9 47459.2 47510.8 47562.0 47623.9 47668.1 47735.4 47930.6 47983.8 48032.7 48043.2 48081.0 48156.7 48231.3 48298.4 48318.0 48465.5 48513.8 48524.8 48597.9 48648.3 48710.6 48750.8 48763.9 48899.4 49059.6 49063.2 49082.9 49195.9 49248.7 49280.5 49343.0 49407.2 49475.9 49500.0 49607.2 49645.0 49694.3 49793.3 49806.4 49855.9 49881.2 49952.4 49984.4 50054.5 50122.9 50162.8 50239.5 50269.6 50323.8 50373.6 50428.5 50501.7 50536.9 50578.9 50644.0 50669.7 50754.6 50782.1
energy: -1891.463391109291
dipole: 8.87258 -5.28551 3.58707 3.09460 -2.43259 0.66201 26.34093 -15.82505 10.51588
magnitude: 11.13055 au
magnitude: 28.29160 debye
