program: Orca
programVersion: 5.0.4
elementType: S S C N N O O C C C C C C C C C C N N C N C C N C C H H H H H H H H H H H H H H H H H H
keywords: PBE0 aug-cc-pVDZ AutoAux D4 VeryTightSCF
charge: 2
multiplicity: 1
formula: C16H18N6O2S2
InChI: InChI=1/C16H18N6O2S2/c1-6-2-4-7(5-3-6)8(9-11(17)19-15(25)21-13(9)23)10-12(18)20-16(26)22-14(10)24/h2-5,8,19-22H,1,17-18H3
44 atoms
S  3.615426 -1.769496 -4.182849
S  -5.587184 0.501516 -1.430094
C  1.81245 0.647298 5.447637
N  0.336012 -3.882366 -1.05917
N  -1.055254 1.456918 0.432892
O  1.131486 0.82967 -0.879393
O  -2.204124 -2.991624 -0.892767
C  -0.226216 -1.439032 0.401803
C  2.160282 -0.134609 3.080806
C  1.685091 -0.610589 1.866387
C  1.3033 0.118625 4.144917
C  0.330398 -0.842583 1.681721
C  -0.055026 -0.136269 3.958164
C  -0.534181 -0.615394 2.751976
C  -1.538801 -0.869596 -0.074734
C  -2.458816 -1.804983 -0.685606
C  -1.932251 0.419756 -0.036389
N  -3.678644 -1.303201 -1.05539
N  -3.149419 0.830842 -0.456891
C  -4.091114 -0.011223 -0.962527
N  1.859218 -2.735006 -2.454543
C  2.541045 -1.659269 -2.937928
C  1.006242 -2.6565 -1.411934
N  2.24009 -0.493962 -2.30621
C  0.737877 -1.510629 -0.750884
C  1.352257 -0.313886 -1.277426
H  0.451921 -4.613968 -1.76791
H  -0.700055 -3.67025 -0.949853
H  -0.086041 1.26816 0.017582
H  -1.360358 2.390226 0.13683
H  -0.476059 -2.464963 0.68193
H  3.224733 0.03958 3.199663
H  2.396779 -0.81084 1.073924
H  -0.749461 0.03359 4.774805
H  -1.594918 -0.822177 2.647586
H  2.688775 0.342685 -2.66422
H  2.026921 -3.626347 -2.911274
H  -3.402742 1.812094 -0.389971
H  -4.334246 -1.958999 -1.467111
H  -0.981862 1.461455 1.459002
H  0.690178 -4.262461 -0.171612
H  2.903249 0.655798 5.472281
H  1.453587 0.044118 6.285778
H  1.463467 1.670462 5.617612
elementType: S C N O H
totalener: -1894.34348219 hartree
nucrepener: 2721.36797201 hartree
electener: -4615.71145420 hartree
oneelecener: -7951.91803506 hartree
twoeener: 3336.20658086 hartree
cpcmener: -0.36529354 hartree
kineticenergy: 1887.08716553 hartree
exchangeener: -145.995665469880 hartree
correlationener: -7.062446018517 hartree
xcener: -153.058111488397 hartree
chargesum: 2.0000000
charge: -0.216185 -0.223223 0.715957 -0.644878 -0.633591 -1.004060 -0.970002 1.423297 -0.292850 0.587354 0.167633 1.659754 0.149362 0.739481 1.296763 0.758696 0.492149 -0.555894 -0.360480 0.442376 -0.481543 0.388282 1.385340 -0.374630 0.203422 0.117737 0.293049 0.233580 0.241789 0.291442 -0.496465 -0.905266 -1.029644 -0.896749 -1.112741 0.029014 0.016030 -0.012340 0.058183 0.371470 0.333502 -0.294660 0.023142 0.086394
charge: 0.565375 0.559668 0.175710 0.535593 0.528245 0.176410 0.162574 -0.064592 0.056112 0.059936 -0.227122 -0.149811 0.057995 0.050682 -0.003859 -0.260162 -0.070059 0.182689 0.185072 -0.690340 0.186983 -0.689446 -0.060337 0.185206 -0.008942 -0.265124 0.119815 -0.046273 -0.061180 0.119957 0.061367 0.024517 0.023845 0.029422 0.039063 0.063985 0.076182 0.074958 0.063913 0.096094 0.132812 -0.004304 0.002366 0.005004
qa: -0.2162 -0.2232 0.7160 -0.6449 -0.6336 -1.0041 -0.9700 1.4233 -0.2929 0.5874 0.1676 1.6598 0.1494 0.7395 1.2968 0.7587 0.4921 -0.5559 -0.3605 0.4424 -0.4815 0.3883 1.3853 -0.3746 0.2034 0.1177 0.2930 0.2336 0.2418 0.2914 -0.4965 -0.9053 -1.0296 -0.8967 -1.1127 0.0290 0.0160 -0.0123 0.0582 0.3715 0.3335 -0.2947 0.0231 0.0864
va: 1.7928 1.7845 3.2091 2.7849 2.9638 1.3630 1.3837 0.7685 3.2955 -0.4159 5.2366 4.8415 1.8255 -0.9622 0.7080 -1.1717 -2.4925 2.7693 2.4659 3.1418 2.7792 3.2444 -7.2843 2.7612 2.9322 1.9360 0.7196 0.9924 0.9364 0.7176 0.4994 0.0054 -0.4982 0.1986 -0.3791 0.8654 0.8537 0.8668 0.8459 0.7479 0.8062 0.7101 0.7860 0.8072
energy: 29798.3 29928.4 31685.0 32522.2 33413.3 33775.3 33924.7 34330.1 35401.2 36172.5 36321.5 36475.2 36782.5 37914.5 38390.6 38789.1 39186.4 40405.0 40630.1 41155.9 41308.8 41925.3 42234.2 42763.3 43470.9 44192.6 44870.0 45052.8 45163.6 46588.5 46837.1 46973.5 47688.7 47753.4 47763.4 47806.7 47854.3 48294.9 48698.7 48840.0 49093.3 49279.5 49525.8 49694.0 49714.5 49847.1 50176.7 50586.8 50856.4 51010.8 51629.4 51684.9 51801.3 51854.3 52194.9 52321.9 52376.2 52458.5 52481.2 52569.3 52628.1 52735.2 52997.3 53172.4 53506.8 53540.8 53775.9 54076.9 54207.1 54237.4 54524.9 54634.1 54705.0 54770.8 54835.1 55108.7 55238.0 55299.8 55481.9 55814.1 55863.8 56066.2 56187.7 56208.9 56293.0 56405.4 56443.1 56597.3 56846.6 56862.4 57009.0 57116.6 57303.9 57349.2 57440.2 57459.9 57532.6 57781.7 57958.4 58119.1 58129.3 58236.1 58329.0 58473.4 58633.4 58658.3 58730.2 58939.4 59006.0 59104.0 59110.3 59153.5 59295.7 59401.2 59445.8 59483.3 59520.1 59538.4 59687.6 59727.6 59828.6 59948.3 60019.1 60084.9 60148.5 60200.9 60359.1 60642.6 60653.5 60796.6 60887.8 60946.9 60956.4 61010.1 61056.2 61231.9 61238.4 61297.0 61366.9 61375.0 61480.9 61541.3 61610.0 61746.6 61808.6 61859.0 61996.0 62041.6 62154.4 62281.0 62407.5 62453.5 62562.3 62632.0 62714.7 62758.1 62779.2 62896.7 62966.3 62998.1 63174.5 63248.0 63291.3 63333.9 63423.5 63453.6 63510.1 63573.2 63630.8 63682.4 63750.0 63806.5 63846.4 63875.0 63884.9 63979.9 64046.0 64121.9 64165.1 64249.2 64347.1 64387.1 64452.0 64470.4 64509.6 64577.1 64607.0 64671.4 64764.6 64794.5 64949.9 64996.8 65056.1 65070.1 65147.9 65194.0 65244.1 65332.9 65474.5 65503.7
energy: -1894.267995933280
dipole: 7.73409 -7.50501 0.22908 1.67865 -3.60061 -1.92197 24.22053 -22.80509 1.41543
magnitude: 2.39789 au
magnitude: 6.09495 debye
