program: Orca
programVersion: 5.0.4
elementType: S S C N N O O C C C C C C C C C C N N C N C C N C C H H H H H H H H H H H H H H H H
keywords: PBE0 aug-cc-pVDZ AutoAux D4 VeryTightSCF
charge: 0
multiplicity: 1
formula: C16H16N6O2S2
InChI: InChI=1/C16H16N6O2S2/c1-6-2-4-7(5-3-6)8(9-11(17)19-15(25)21-13(9)23)10-12(18)20-16(26)22-14(10)24/h2-5,8,19-22H,17-18H2,1H3
42 atoms
S  -4.20985 -4.09701 -2.12428
S  5.7778 -1.52514 -1.34079
C  -1.24796 4.2581 2.62762
N  -1.1323 -0.26204 -1.88307
N  1.97688 -3.22343 1.29382
O  -0.87493 -3.64438 1.43712
O  1.41287 0.68191 -1.35999
C  0.14434 -1.07694 0.69073
C  -1.87187 2.04077 1.60836
C  -1.5428 0.78042 1.12358
C  -0.90165 2.89342 2.11968
C  -0.22952 0.33285 1.12768
C  0.41464 2.43177 2.14151
C  0.74335 1.17821 1.65782
C  1.5265 -1.19175 0.09084
C  2.03023 -0.25698 -0.84665
C  2.34665 -2.24073 0.47022
N  3.36668 -0.41739 -1.22007
N  3.63448 -2.30259 0.00506
C  4.19379 -1.40068 -0.83071
N  -2.48165 -2.11396 -1.84482
C  -2.97108 -3.27701 -1.36388
C  -1.47761 -1.38328 -1.2598
N  -2.37418 -3.71381 -0.24186
C  -0.92046 -1.82249 -0.07127
C  -1.3418 -3.07346 0.44387
H  -2.89435 -1.77293 -2.70415
H  4.21967 -3.0779 0.28855
H  -1.52927 -0.04919 -2.78503
H  -0.2651 0.21789 -1.61882
H  0.9861 -3.38792 1.47561
H  2.61221 -3.98654 1.47283
H  -2.68969 -4.59583 0.14034
H  3.73282 0.26429 -1.87179
H  0.20019 -1.62019 1.6398
H  -2.90828 2.36363 1.58604
H  -2.33147 0.14132 0.74395
H  1.19681 3.06885 2.54406
H  1.77782 0.85263 1.69065
H  -2.32483 4.43238 2.58978
H  -0.91807 4.39346 3.6617
H  -0.76038 5.03695 2.03334
elementType: S C N O H
totalener: -1893.50133911 hartree
nucrepener: 2653.22608141 hartree
electener: -4546.72742052 hartree
oneelecener: -7868.33535277 hartree
twoeener: 3321.60793226 hartree
cpcmener: -0.05892281 hartree
kineticenergy: 1886.46039087 hartree
exchangeener: -145.874031145064 hartree
correlationener: -7.059632302081 hartree
xcener: -152.933663447145 hartree
chargesum: 0.0000000
charge: -0.317751 -0.315585 0.733358 -0.139200 -0.192881 -0.917592 -0.992075 1.189183 -0.495909 0.777604 0.110723 1.113125 -0.022966 1.156201 1.405775 0.354198 0.554311 -0.427590 -0.505146 0.460827 -0.345236 0.457155 -0.336517 -0.493649 1.055649 0.777415 -0.009408 0.026004 -0.054927 0.045486 -0.040283 -0.022078 0.023529 0.000765 -0.503967 -0.924430 -1.008487 -0.911378 -1.050037 -0.314562 0.041184 0.059163
charge: 0.464583 0.465310 0.167669 0.372895 0.370052 0.094353 0.113376 -0.084879 0.037553 0.044714 -0.242888 -0.142808 0.039610 0.046263 -0.046013 -0.332742 -0.178671 0.155794 0.165390 -0.715956 0.165936 -0.715818 -0.191776 0.154980 -0.051689 -0.333964 0.053647 0.053918 0.032213 -0.101075 -0.090402 0.031708 0.045139 0.044574 0.037124 0.017888 0.014696 0.022437 0.023489 -0.007189 -0.000314 0.000873
qa: -0.3178 -0.3156 0.7334 -0.1392 -0.1929 -0.9176 -0.9921 1.1892 -0.4959 0.7776 0.1107 1.1131 -0.0230 1.1562 1.4058 0.3542 0.5543 -0.4276 -0.5051 0.4608 -0.3452 0.4572 -0.3365 -0.4936 1.0556 0.7774 -0.0094 0.0260 -0.0549 0.0455 -0.0403 -0.0221 0.0235 0.0008 -0.5040 -0.9244 -1.0085 -0.9114 -1.0500 -0.3146 0.0412 0.0592
va: 1.6813 1.6843 3.1262 2.9546 3.0445 1.3017 1.4155 0.0718 3.4940 -1.1394 5.4319 5.4599 1.5681 -2.8745 1.1456 2.0457 -2.3226 2.7153 2.7723 3.0497 2.6498 3.0429 0.6916 2.8048 2.5051 -0.5461 0.8416 0.8279 0.8551 0.8370 0.9756 0.8316 0.8575 0.8607 0.6420 -0.0136 -0.4588 0.1878 -0.3947 0.7151 0.7894 0.7922
energy: 33374.0 33412.5 33784.0 36231.0 36811.2 38459.0 38978.3 39440.2 40157.2 40435.4 40684.9 40995.8 41210.5 41308.9 41482.0 41895.1 42031.4 42440.5 42602.3 42708.2 42838.9 42912.8 43006.0 44061.0 44334.7 44592.1 45053.1 45162.6 45360.2 45482.1 45505.9 45725.7 45810.8 45912.9 46035.0 46195.2 46268.9 46413.9 46800.7 46858.1 47090.8 47154.1 47320.9 47776.3 47973.8 48157.4 48301.4 48490.0 48608.0 48664.1 48799.9 48878.9 48908.4 48988.1 49047.1 49133.4 49295.9 49412.7 49507.2 49728.8 49800.1 49860.1 49898.0 50004.3 50124.4 50234.3 50265.4 50422.6 50562.4 50882.5 51050.8 51088.2 51220.2 51284.0 51408.7 51432.5 51570.0 51627.2 52023.9 52061.0 52104.4 52372.6 52431.0 52511.4 52541.2 52662.4 52771.0 52865.3 52980.0 53074.5 53106.8 53388.9 53482.2 53786.2 53846.7 53965.1 54026.9 54176.7 54221.9 54274.6 54347.9 54376.5 54409.0 54598.1 54631.0 54674.4 54722.0 54792.7 54846.6 54872.4 55004.1 55118.3 55162.9 55280.5 55397.5 55452.2 55501.8 55586.1 55664.8 55723.0 55803.0 55864.7 55896.7 56050.2 56163.1 56252.7 56495.9 56511.5 56596.0 56904.0 56970.0 57111.7 57168.6 57231.3 57319.6 57363.8 57390.8 57547.4 57623.1 57652.5 57693.1 57705.4 57876.4 58056.5 58132.4 58140.6 58156.7 58256.2 58297.1 58443.1 58490.4 58503.6 58601.8 58631.3 58707.8 58766.0 58788.7 58839.5 58909.2 58942.0 58962.6 58997.1 59069.8 59190.5 59263.9 59334.4 59373.9 59414.7 59478.2 59559.5 59608.1 59768.5 59849.1 59857.5 59936.3 59964.6 60056.5 60120.2 60138.8 60207.5 60252.3 60389.4 60492.8 60554.0 60615.8 60671.1 60781.1 60908.9 60932.5 60998.1 61070.8 61146.7 61161.1 61294.2 61344.2 61353.4 61387.2 61600.7 61612.9 61694.8
energy: -1893.409404320296
dipole: -5.10712 5.18344 0.07632 18.25725 -17.88950 0.36775 11.70547 -11.23428 0.47118
magnitude: 0.60256 au
magnitude: 1.53159 debye
