program: Orca
programVersion: 5.0.4
elementType: S S C N N O O C C C C C C C C C C N N C N C C N C C H H H H H H H H H H H H H H H H H H
keywords: PBE0 aug-cc-pVDZ AutoAux D4 VeryTightSCF
charge: 2
multiplicity: 1
formula: C16H18N6O2S2
InChI: InChI=1/C16H18N6O2S2/c1-6-2-4-7(5-3-6)8(9-11(17)19-15(25)21-13(9)23)10-12(18)20-16(26)22-14(10)24/h2-5,8,19-24H,17-18H2,1H3
44 atoms
S  3.449739 -2.226716 -4.363533
S  -5.537296 1.205383 -1.247094
C  1.627725 0.114949 5.4654
N  1.522801 -3.587105 -0.031934
N  -0.950175 1.452447 0.566667
O  0.432486 0.661964 -1.927136
O  -2.616914 -2.651588 -1.227047
C  -0.340002 -1.432631 0.195468
C  1.890745 -0.019105 2.965757
C  1.436997 -0.392748 1.706907
C  1.140214 -0.274226 4.109202
C  0.205355 -1.022639 1.559227
C  -0.089264 -0.921731 3.950035
C  -0.551793 -1.288128 2.701097
C  -1.627626 -0.720942 -0.189459
C  -2.654244 -1.40233 -0.838133
C  -1.897558 0.628951 0.076982
N  -3.816845 -0.811423 -1.143762
N  -3.084948 1.165324 -0.251079
C  -4.135789 0.506874 -0.878177
N  2.351658 -2.820012 -2.029326
C  2.505074 -1.938823 -3.09113
C  1.536339 -2.645476 -0.972614
N  1.785856 -0.777659 -2.893196
C  0.706954 -1.504446 -0.899573
C  0.951446 -0.53921 -1.866157
H  2.127801 -4.391852 -0.091164
H  -1.776664 -3.083748 -1.032836
H  0.048189 0.975172 -1.088034
H  -1.199004 2.403224 0.802882
H  -0.656056 -2.475412 0.347365
H  2.853731 0.470341 3.058245
H  2.061068 -0.193334 0.841232
H  -0.689484 -1.144951 4.82545
H  -1.51227 -1.788231 2.614715
H  1.926252 -0.043228 -3.578119
H  2.943659 -3.639344 -2.09547
H  -3.284383 2.137092 -0.045272
H  -4.530239 -1.358568 -1.614369
H  -0.247795 1.027767 1.172185
H  1.164562 -3.373093 0.885869
H  2.597325 0.609106 5.419463
H  1.722504 -0.763551 6.108626
H  0.921386 0.790858 5.95381
totalener: -1894.04786809 hartree
nucrepener: 2706.57031469 hartree
electener: -4600.61818279 hartree
oneelecener: -7925.84166236 hartree
twoeener: 3325.22347957 hartree
kineticenergy: 1887.20746562 hartree
exchangeener: -146.030457297298 hartree
correlationener: -7.064585781050 hartree
xcener: -153.095043078348 hartree
chargesum: 2.0000000
charge: 0.016753 0.035536 0.786978 -0.022142 -0.283336 -0.597665 -0.678226 1.142918 -0.263475 1.724157 0.429937 1.069646 -0.010427 0.754411 0.941261 0.561086 -0.165466 -0.442313 -0.363786 0.439450 -0.369917 0.376431 0.213893 -0.278458 1.197150 0.141796 -0.058640 0.243003 0.281339 -0.014718 -0.595053 -0.861720 -1.175237 -0.868542 -1.226143 -0.035228 -0.039916 -0.043479 -0.005772 0.155567 0.051884 -0.304489 0.073428 0.067523
charge: 0.787997 0.799177 0.199948 0.387046 0.386432 0.360880 0.369078 -0.092235 0.078973 0.033886 -0.196778 -0.204874 0.083307 0.063306 -0.026789 -0.173758 -0.175143 0.179244 0.178925 -0.699711 0.174347 -0.704739 -0.168840 0.173029 -0.040006 -0.186887 0.040851 -0.012741 -0.080002 0.045311 0.035880 0.031532 0.021766 0.037705 0.033122 0.063118 0.054099 0.054799 0.067530 -0.028119 0.015688 0.003376 0.016058 0.014211
qa: 0.0168 0.0355 0.7870 -0.0221 -0.2833 -0.5977 -0.6782 1.1429 -0.2635 1.7242 0.4299 1.0696 -0.0104 0.7544 0.9413 0.5611 -0.1655 -0.4423 -0.3638 0.4395 -0.3699 0.3764 0.2139 -0.2785 1.1972 0.1418 -0.0586 0.2430 0.2813 -0.0147 -0.5951 -0.8617 -1.1752 -0.8685 -1.2261 -0.0352 -0.0399 -0.0435 -0.0058 0.1556 0.0519 -0.3045 0.0734 0.0675
va: 1.9895 2.0028 3.1251 3.0485 2.8712 1.3423 1.4356 -1.2475 3.7375 -3.1481 4.4124 4.4314 1.6753 -1.8082 1.8915 -0.9298 0.4258 2.6977 2.7792 3.1727 2.6826 3.2284 -0.1317 2.6169 2.4398 2.5782 0.8664 1.0171 0.9343 0.8495 0.4666 0.0585 -0.6468 0.2627 -0.5397 0.9071 0.8810 0.8814 0.8955 0.7975 0.8767 0.7337 0.8152 0.8079
energy: 27749.6 27931.5 27974.4 28569.4 29211.4 30386.6 31074.6 31514.0 32325.1 33556.9 34164.6 34891.7 35782.8 36379.0 36516.2 37618.5 38048.4 38647.6 38945.7 40514.5 41183.8 41861.3 42462.9 42726.1 43028.4 43411.6 43590.2 44154.9 44468.1 44930.7 45704.4 46063.4 46203.8 46432.0 46732.2 47082.7 47262.1 47402.4 47753.6 48499.5 48594.9 48769.8 49039.9 49269.1 49388.7 49609.7 49644.0 49952.7 50570.8 50711.0 51201.2 51588.5 51740.8 51975.4 52213.8 52453.5 52644.1 52953.8 53069.8 53495.9 53872.9 53941.4 54083.6 54162.3 54617.1 55030.9 55146.7 55192.2 55236.2 55444.0 55537.8 55561.6 55574.4 55619.0 56176.3 56231.2 56518.2 56722.8 56741.9 56822.6 56894.2 57042.9 57090.9 57423.6 57525.7 57657.8 57684.0 57868.8 57956.7 58225.3 58337.1 58426.3 58505.8 58647.2 58679.1 58749.8 58857.8 59000.0 59152.2 59204.2 59237.1 59349.1 59412.2 59512.6 59718.1 59757.2 59919.6 59921.8 60051.0 60091.6 60143.7 60193.3 60553.9 60610.2 60619.6 60766.2 60834.8 61057.1 61207.0 61303.6 61499.3 61586.9 61729.6 61808.0 61870.1 61952.5 62034.2 62339.5 62421.9 62563.5 62657.0 62766.2 62850.2 62976.6 63116.8 63149.6 63221.4 63345.0 63365.6 63528.2 63622.2 63648.9 63940.4 64004.2 64116.9 64368.8 64425.2 64461.9 64544.7 64622.2 64837.8 65074.2 65128.5 65305.2 65356.7 65415.2 65449.0 65540.4 65604.4 65721.8 65845.6 65906.6 65954.6 66011.7 66080.5 66142.4 66220.7 66308.0 66441.5 66483.1 66529.0 66740.8 66794.5 66832.6 67096.3 67167.2 67284.5 67379.1 67440.9 67535.3 67570.2 67786.8 67821.2 67907.4 67943.3 68048.8 68191.5 68382.4 68504.8 68549.2 68623.9 68704.4 68713.4 68734.9 68758.9 68796.9 68901.8 69150.9 69334.3 69394.5
energy: -1893.981028711481
dipole: 9.38429 -8.89941 0.48488 0.31814 -1.01009 -0.69195 26.39470 -24.90999 1.48471
magnitude: 1.70829 au
magnitude: 4.34214 debye
