program: Gaussian 09
title: 000050526
version: EM64L-G09RevD.01
frameworkgroup: C1[X(C23H22ClN3O)]
method: RPBEPBE
basis: SDD
operation: Freq
keyword: #p
keyword: freq=noraman
keyword: PBEPBE/SDD
title: #p freq=noraman PBEPBE/SDD
converged: YES YES NO NO
title: Mulliken charges:
elementType: Cl O N N N C C C C C C C C C C C C C C C C C C C C C C C H H H H H H H H H H H H H H H H H H H H H H
charge: -0.058595 -0.265572 -0.473878 -0.519376 -0.107065 0.159747 0.448340 -0.551231 0.428405 0.445040 -0.301255 -0.472371 0.345028 -0.386666 -0.331089 -0.395024 -0.408865 -0.425547 -0.362236 -0.228686 -0.229724 -0.244473 -0.182120 -0.191824 -0.127022 -0.344205 -0.064799 -0.554779 0.230993 0.205721 0.323150 0.321167 0.311320 0.218064 0.249145 0.244105 0.267976 0.222783 0.236047 0.281393 0.224171 0.222755 0.256358 0.257091 0.225732 0.209962 0.213061 0.237353 0.218629 0.222864
chargesum: 0.00000
title: Mulliken charges with hydrogens summed into heavy atoms:
elementType: Cl O N N N C C C C C C C C C C C C C C C C C C C C C C C
charge: -0.058595 -0.265572 -0.150728 -0.198209 -0.107065 0.159747 0.448340 -0.114516 0.428405 0.445040 0.010065 -0.254307 0.345028 -0.137521 -0.086984 -0.127048 -0.186082 -0.189499 -0.080843 -0.004515 -0.006970 -0.018740 0.074237 0.065267 -0.127022 0.078818 0.172553 -0.113285
polarizability: 4.07220303e+02 1.30689570e+01 3.65404891e+02 1.47116057e+01 -5.83294114e+00 1.60443361e+02
1716.lowfreq: -3.5806 -0.0008 0.0007 0.0014 3.3271 5.9523 14.3973 17.9811 25.2249
frequency: 14.3643 17.9340 25.2073 29.1448 31.6603 35.4704 46.1730 61.0379 71.2393 91.8944 103.4228 113.9609 129.4066 141.1616 156.3676 176.4178 202.8671 211.2720 236.0917 260.2684 273.8064 305.3931 337.2449 350.9279 359.5497 379.1015 405.2377 408.3024 411.6333 414.5820 459.5235 463.4704 480.2160 487.6881 501.6141 519.0975 521.3034 560.2012 596.7068 599.2560 616.5420 624.5867 628.9612 649.2044 684.6581 690.5429 703.9944 706.9322 716.5984 738.1666 782.0165 795.8584 807.5968 814.1452 823.5667 828.8595 849.8132 857.9680 861.2993 905.1025 912.3854 918.9252 932.7081 938.3496 954.4676 958.9001 974.5542 975.4384 980.7853 983.3379 984.8477 990.5192 990.9681 999.6477 1003.6565 1012.4529 1025.4514 1063.2180 1076.2150 1082.7096 1113.4730 1119.7250 1149.3410 1169.2828 1178.5974 1181.1431 1186.3311 1200.4071 1209.1289 1219.8250 1221.9468 1227.0430 1275.0978 1282.0268 1286.0971 1295.0645 1304.2903 1310.6755 1341.5847 1346.3459 1348.1672 1377.6423 1386.4937 1404.6379 1426.0564 1433.2955 1436.6997 1443.2261 1464.3795 1469.8486 1481.3241 1483.0456 1500.3891 1527.5742 1585.8777 1594.5027 1594.8960 1607.1042 1615.9931 1630.9252 1644.0807 1667.4272 2855.5878 2930.6950 2933.0685 3003.3819 3092.7096 3106.1946 3109.3384 3123.5849 3123.9466 3130.6794 3137.2306 3155.3119 3156.8476 3158.8430 3162.7803 3167.9757 3171.3709 3176.5240 3188.2031 3203.0047 3535.5237 3547.1712
redmass: 6.7439 6.1356 4.3111 4.7049 4.4515 4.3698 3.9393 3.9629 4.1338 3.7903 5.9087 3.0630 3.9367 4.2821 6.3549 6.3260 5.5955 3.7760 3.0851 4.4146 5.6864 4.9424 4.2748 4.9654 4.9341 4.5719 3.1324 3.6878 3.1452 3.0835 2.9802 2.5697 1.4593 3.2251 4.8148 3.0487 2.7312 1.2544 2.9556 4.3340 6.3635 5.0365 6.8428 3.1590 6.3563 4.9212 2.4836 4.2849 3.7126 1.3776 5.2388 1.4089 2.2971 2.2331 2.7143 1.7370 1.4601 1.2582 4.8715 1.4118 1.3985 1.6801 4.5753 1.3464 1.3381 1.3421 1.8926 3.0776 1.4046 1.5859 1.5039 4.0875 4.1163 2.1479 1.5453 1.2790 2.1589 3.6311 2.4350 1.8520 1.3507 1.3082 1.6709 1.0643 1.1877 1.2248 1.1135 1.9082 2.3483 1.2361 1.3614 2.5452 2.5538 1.2652 1.7567 1.3612 1.4669 1.6768 1.5206 1.5190 3.0379 4.8203 6.6317 3.9668 3.8871 1.2130 1.8513 1.2104 1.6971 1.1382 2.6141 2.3287 2.3006 2.2993 6.4627 4.6550 5.6301 6.3527 6.1326 6.3971 5.1257 4.8133 1.0651 1.0903 1.0581 1.1026 1.0608 1.0876 1.0896 1.0863 1.0946 1.0899 1.0926 1.0969 1.0885 1.0903 1.0931 1.0976 1.0953 1.0972 1.0953 1.1143 1.0758 1.0755
irintensity: 0.1170 0.6988 0.2751 0.4729 0.0903 1.6939 0.1401 0.0610 0.2373 0.4830 3.3468 0.6148 0.8334 3.5065 7.5923 4.0523 1.4329 5.7984 2.3445 1.5927 1.2116 3.6035 6.8490 0.9938 4.3327 0.2498 2.9115 2.8545 0.3805 0.2149 9.4427 28.5782 83.5491 13.4163 7.7633 12.1807 51.3600 77.8861 17.3286 16.8457 2.2375 3.1041 6.9277 5.2313 7.6332 8.5978 20.1065 26.8939 0.2486 78.4173 26.8276 40.7101 24.6653 15.9644 10.2940 31.2903 52.4267 0.3449 8.4922 3.3592 1.7353 7.0257 2.2140 0.3102 116.7023 1.2172 16.1188 123.5111 4.7118 13.0263 0.1434 0.2337 25.4625 9.3240 5.9906 12.4134 11.6984 50.2338 27.7566 2.3708 7.3737 31.8903 7.3216 2.3036 67.7804 53.7029 13.6164 2.4105 308.5640 1.1706 60.4201 50.6669 85.8315 13.5377 132.3316 32.6230 30.6579 77.5736 75.1863 7.5351 61.0620 149.8428 18.8480 0.3036 3.1719 60.8192 39.0686 38.8295 27.8559 63.2407 404.6376 11.3902 194.7260 438.5903 18.5287 45.5041 25.7096 65.5489 22.8544 0.8350 718.5161 4.4580 74.3077 32.6202 43.4405 33.9793 10.0729 12.0367 26.0195 0.6268 7.9229 10.8886 31.4932 41.5601 3.9966 4.5448 15.5069 12.1534 6.0319 0.5791 14.0725 27.0828 24.9336 31.4676
temp: 298.150 k
press: 1.00000 atm
elementType: 17 8 7 7 7 6 6 6 6 6 6 6 6 6 6 6 6 6 6 6 6 6 6 6 6 6 6 6 1 1 1 1 1 1 1 1 1 1 1 1 1 1 1 1 1 1 1 1 1 1
symmnumber: 1
zpe: 1033257.4 jmol-1
zpe.correction: 0.393547 hartree
zpe.thermalcorrener: 0.419737 hartree
zpe.thermalcorrenthalpy: 0.420681 hartree
zpe.thermalcorrgfe: 0.331998 hartree
zpe.sumelectzpe: -1587.160310 hartree
zpe.sumelectthermal: -1587.134120 hartree
zpe.sumelectthermalent: -1587.133176 hartree
zpe.sumelectthermalfe: -1587.221859 hartree
dipole: -1.1537 -1.0423 -1.6772
dipole: 2.2870
quadrupole: -162.0736 -163.2710 -173.9474
quadrupole: -22.1703 6.4258 2.9698
quadrupole: 4.3571 3.1596 -7.5167 -22.1703 6.4258 2.9698
hfenergy: -1587.5538572 hartree
pointgroup: C01 [X(C23H22Cl1N3O1)]
dipole: 0.2225176 -0.5745956 0.6557042 debye
polarizability: 387.6363267|-24.6636811|385.6226329|10.1432248|-1.6550099|159.8095955 unknown
InChI: InChI=1S/C23H22ClN3O/c1-2-16-28-22-14-12-21(13-15-22)27-23(25-17-18-6-4-3-5-7-18)26-20-10-8-19(24)9-11-20/h2-15,26-27H,1,16-17H2
charge 0 multiplicity 1
50 atoms
Cl 3.413258 -6.763292 -0.983291
O  -5.198053 0.54154 -0.125275
N  0.21578 -0.871931 0.792368
N  2.566241 -0.978709 0.638917
N  1.422987 1.142777 0.414499
C  1.397726 -0.156565 0.585493
C  -1.132514 -0.47963 0.569421
C  2.702851 1.802629 0.095588
C  2.508852 3.283387 -0.228287
C  2.718153 -2.336453 0.257497
C  -1.51457 0.805132 0.09146
C  -2.141637 -1.443171 0.827751
C  -3.875582 0.12969 0.13043
C  -2.872289 1.094681 -0.129118
C  -3.505045 -1.149193 0.614637
C  1.362436 3.986786 0.212085
C  3.513129 3.984416 -0.941578
C  3.799619 -3.082938 0.804162
C  1.857295 -2.965427 -0.687202
C  1.224229 5.368318 -0.053747
C  3.377694 5.365342 -1.208136
C  2.230522 6.063519 -0.763606
C  4.021188 -4.421732 0.422483
C  2.06568 -4.311342 -1.056009
C  3.143466 -5.025504 -0.498713
C  -6.275068 -0.422167 0.179356
C  -7.58509 0.276551 -0.069529
C  -8.597279 -0.246175 -0.803177
H  3.222473 1.306891 -0.755681
H  3.408255 1.746309 0.962442
H  0.338219 -1.818427 1.157624
H  3.40474 -0.510643 0.986109
H  -0.738769 1.550977 -0.088711
H  -1.863524 -2.439527 1.196338
H  -3.177261 2.078131 -0.500261
H  -4.251815 -1.921027 0.821985
H  0.590343 3.433958 0.75561
H  4.403514 3.44845 -1.296747
H  4.467793 -2.617124 1.538301
H  1.044356 -2.401998 -1.153692
H  0.331191 5.901623 0.2923
H  4.160154 5.893321 -1.765315
H  4.856211 -4.987031 0.846124
H  1.404009 -4.788059 -1.785174
H  2.121753 7.134037 -0.971564
H  -6.19143 -0.726102 1.246271
H  -6.175215 -1.326174 -0.455412
H  -7.691256 1.258503 0.410704
H  -8.505661 -1.217545 -1.305094
H  -9.54816 0.283519 -0.924634
