program: Orca
programVersion: 5.0.4
elementType: S S O N N O O C C C C C C C C C C N N C N C C N C C H H H H H H H H H H
keywords: PBE0 ma-def2-TZVP AutoAux D4 VeryTightSCF TightOPT
charge: -4
multiplicity: 1
formula: C15H10N6O3S2
InChI: InChI=1/C15H10N6O3S2/c16-10-8(12(23)20-14(25)18-10)7(5-1-3-6(22)4-2-5)9-11(17)19-15(26)21-13(9)24/h1-4,7,22H,16-17H2
36 atoms
S  3.859664 -1.539033 -4.053374
S  -5.807028 0.06124 -1.058968
O  1.750393 0.475069 5.401892
N  0.164885 -3.540888 -1.463973
N  -1.128098 1.370937 -0.188268
O  1.608551 0.879532 -0.413783
O  -2.324754 -3.228806 0.059262
C  -0.174053 -1.384107 0.376508
C  2.150062 -0.653129 3.306786
C  1.661102 -1.06993 2.079858
C  1.318123 0.031161 4.184782
C  0.345779 -0.823683 1.690688
C  0.002348 0.278158 3.826576
C  -0.470102 -0.151301 2.592933
C  -1.585734 -0.983183 0.00877
C  -2.587541 -1.982771 -0.114623
C  -1.992538 0.320801 -0.27142
N  -3.862354 -1.640526 -0.43475
N  -3.257559 0.641962 -0.601418
C  -4.15362 -0.354843 -0.65887
N  1.835695 -2.490703 -2.624908
C  2.648283 -1.435275 -2.792967
C  0.943762 -2.423137 -1.622784
N  2.582754 -0.317676 -2.064121
C  0.823298 -1.327522 -0.767424
C  1.668028 -0.225282 -1.062703
H  0.18092 -4.172203 -2.249349
H  -0.728057 -3.459953 -0.978131
H  -0.117651 1.193696 -0.218142
H  -1.451557 2.220669 -0.622672
H  -0.273466 -2.451527 0.601328
H  3.180274 -0.85366 3.587064
H  2.325206 -1.595677 1.401053
H  -0.648771 0.807538 4.514457
H  -1.50306 0.04572 2.329528
H  2.678103 0.237942 5.519213
totalener: -1927.70540830 hartree
nucrepener: 2552.37001058 hartree
electener: -4480.07541888 hartree
oneelecener: -7816.39118694 hartree
twoeener: 3336.31576805 hartree
cpcmener: -0.90983732 hartree
kineticenergy: 1921.45291708 hartree
exchangeener: -147.280998485741 hartree
correlationener: -7.052512714353 hartree
xcener: -154.333511200094 hartree
elementType: S O N C H
chargesum: -4.0000000
charge: -0.932727 -0.936265 -0.487778 -0.675246 -0.582704 -0.825106 -0.885114 -0.769067 -0.379832 0.161747 0.460481 -0.749263 -0.269180 0.199187 0.237996 0.284328 0.002433 -0.708510 -0.683826 0.419284 -0.684330 0.463372 -0.024127 -0.654304 1.331407 0.278279 0.287749 0.297367 0.302792 0.283496 0.122055 0.171934 0.185304 0.172663 0.193213 0.392292
charge: -0.205651 -0.206174 -0.038060 -0.107973 -0.094986 -0.259094 -0.290928 -0.181713 -0.159411 -0.133117 -0.305809 -0.170373 -0.153189 -0.141591 -0.177518 -0.460032 -0.357523 -0.084160 -0.078041 -0.688452 -0.077973 -0.688189 -0.348566 -0.078134 -0.172044 -0.459271 0.209163 0.207146 0.211963 0.209571 0.233363 0.195472 0.205731 0.195738 0.207537 0.242288
qa: -0.9327 -0.9363 -0.4878 -0.6752 -0.5827 -0.8251 -0.8851 -0.7691 -0.3798 0.1617 0.4605 -0.7493 -0.2692 0.1992 0.2380 0.2843 0.0024 -0.7085 -0.6838 0.4193 -0.6843 0.4634 -0.0241 -0.6543 1.3314 0.2783 0.2877 0.2974 0.3028 0.2835 0.1221 0.1719 0.1853 0.1727 0.1932 0.3923
va: 1.1057 1.1044 1.8622 2.9642 2.7883 1.4490 1.4364 3.3914 4.5415 3.3481 3.5848 5.2640 4.1101 3.6521 2.3430 3.9214 4.4060 2.6828 2.6049 3.6204 2.6133 3.5029 4.2162 2.6878 -0.4567 4.0723 0.9347 0.9327 0.9425 0.9366 0.9764 0.9652 0.9333 0.9620 0.9362 0.8581
energy: -1927.772344946055
dipole: 5.56976 -1.32711 4.24264 0.12754 0.29792 0.42546 14.25558 -4.45034 9.80524
magnitude: 10.69223 au
magnitude: 27.17750 debye
