program: Orca
programVersion: 5.0.4
elementType: S S O N N O O C C C C C C C C C C N N C N C C N C C H H H H H H H H H H H H H H H H
keywords: PBE0 aug-cc-pVDZ AutoAux D4 VeryTightSCF
charge: 2
multiplicity: 1
formula: C15H16N6O3S2
InChI: InChI=1/C15H16N6O3S2/c16-10-8(12(23)20-14(25)18-10)7(5-1-3-6(22)4-2-5)9-11(17)19-15(26)21-13(9)24/h1-4,7,18-22H,16-17H3
42 atoms
S  3.625136 -1.777158 -4.162844
S  -5.57903 0.50583 -1.414405
O  1.730738 0.617067 5.32401
N  0.338388 -3.882714 -1.041886
N  -1.044409 1.462632 0.439611
O  1.145734 0.827719 -0.861216
O  -2.199199 -2.989202 -0.872308
C  -0.218978 -1.437997 0.420225
C  2.184248 -0.129765 3.085826
C  1.697479 -0.612237 1.881678
C  1.31178 0.135476 4.133615
C  0.340275 -0.836465 1.696335
C  -0.048608 -0.105274 3.97051
C  -0.520049 -0.59447 2.76645
C  -1.530169 -0.866161 -0.05916
C  -2.452053 -1.801685 -0.667397
C  -1.922186 0.423854 -0.024878
N  -3.671644 -1.29967 -1.037455
N  -3.139436 0.835083 -0.445385
C  -4.082763 -0.00712 -0.94746
N  1.864912 -2.738705 -2.436079
C  2.549839 -1.664728 -2.918806
C  1.011334 -2.658186 -1.394014
N  2.251237 -0.498863 -2.287131
C  0.745226 -1.51181 -0.732748
C  1.363203 -0.31665 -1.258938
H  0.450434 -4.613067 -1.752483
H  -0.697092 -3.667901 -0.930299
H  -0.073857 1.268797 0.02963
H  -1.346867 2.39388 0.13444
H  -0.471593 -2.463605 0.698692
H  3.24946 0.040241 3.208901
H  2.409418 -0.824032 1.09261
H  -0.72948 0.082778 4.792508
H  -1.582393 -0.794169 2.666073
H  2.702174 0.336791 -2.644624
H  2.030264 -3.630492 -2.892839
H  -3.391812 1.816708 -0.380111
H  -4.328269 -1.95597 -1.446737
H  -0.975121 1.476685 1.465697
H  0.693644 -4.265604 -0.156012
H  2.690186 0.726357 5.307964
elementType: S O N C H
totalener: -1930.23875304 hartree
nucrepener: 2726.85376939 hartree
electener: -4657.09252243 hartree
oneelecener: -8013.76453273 hartree
twoeener: 3356.67201030 hartree
cpcmener: -0.37030819 hartree
kineticenergy: 1922.86243320 hartree
exchangeener: -147.782068625388 hartree
correlationener: -7.084755281994 hartree
xcener: -154.866823907382 hartree
chargesum: 2.0000000
charge: -0.216086 -0.222400 -0.737159 -0.636400 -0.641801 -1.003567 -0.967701 1.307743 -0.334758 0.779113 0.296167 1.915927 0.035264 1.166796 1.389347 0.721327 0.528993 -0.552748 -0.373015 0.448079 -0.483285 0.381148 1.388250 -0.373173 0.179439 0.075274 0.291839 0.236782 0.247997 0.290627 -0.531284 -0.849641 -0.980355 -0.735718 -1.084546 0.029056 0.015689 -0.011648 0.057861 0.375698 0.337161 0.239709
charge: 0.565184 0.559366 0.240065 0.535456 0.528051 0.176572 0.162595 -0.065744 0.066343 0.056132 -0.267660 -0.152521 0.063041 0.046922 -0.003343 -0.259955 -0.070041 0.182563 0.184900 -0.690464 0.186990 -0.689488 -0.060356 0.185115 -0.009022 -0.264917 0.119685 -0.046851 -0.061778 0.119794 0.060202 0.028061 0.025859 0.026131 0.040833 0.063958 0.076212 0.074929 0.063893 0.096369 0.132799 -0.025880
qa: -0.2161 -0.2224 -0.7372 -0.6364 -0.6418 -1.0036 -0.9677 1.3077 -0.3348 0.7791 0.2962 1.9159 0.0353 1.1668 1.3893 0.7213 0.5290 -0.5527 -0.3730 0.4481 -0.4833 0.3811 1.3882 -0.3732 0.1794 0.0753 0.2918 0.2368 0.2480 0.2906 -0.5313 -0.8496 -0.9804 -0.7357 -1.0845 0.0291 0.0157 -0.0116 0.0579 0.3757 0.3372 0.2397
va: 1.7913 1.7838 1.2250 2.8078 2.9607 1.3612 1.3839 1.1100 3.1067 -1.4549 3.2557 5.2134 2.1770 -2.1145 0.7483 -1.0854 -2.5563 2.7680 2.4783 3.1317 2.7786 3.2582 -7.3524 2.7519 2.9613 2.0131 0.7221 0.9873 0.9260 0.7204 0.4930 0.2047 -0.3814 0.3616 -0.3450 0.8657 0.8543 0.8658 0.8463 0.7383 0.8006 0.9156
energy: 29211.4 29853.1 29937.6 31482.3 32271.8 33577.5 33742.2 33926.8 35269.7 35442.6 36236.9 36302.3 36496.7 36762.8 37132.0 38593.0 39467.6 40184.9 40614.3 40961.5 41161.9 41242.1 41690.1 43255.7 44167.4 44370.0 44827.5 45004.6 45029.5 45171.2 46289.6 46652.3 46916.4 47298.7 47661.9 47722.6 47766.6 47778.9 48389.1 48401.4 48720.3 48858.1 49101.9 49197.0 49209.9 49617.9 50401.3 50557.7 50767.0 50899.3 50973.1 51222.6 51514.8 51699.4 51769.7 51888.4 52114.8 52212.5 52356.1 52381.1 52548.5 52602.6 52658.7 52833.7 53137.0 53252.0 53487.5 53653.5 53690.4 53936.2 54059.9 54072.3 54209.0 54424.6 54541.3 54613.4 54720.1 54806.1 54820.1 55037.9 55698.5 55851.2 55935.3 56114.9 56158.3 56178.0 56239.9 56268.9 56400.3 56517.1 56631.0 56755.4 56769.7 56870.4 57000.1 57047.3 57123.2 57193.2 57339.5 57471.3 57579.0 57783.6 57800.2 57826.5 57913.7 58077.8 58174.1 58416.9 58518.8 58628.0 58720.6 58819.7 58958.3 58981.3 59046.7 59109.2 59196.7 59297.8 59697.4 59795.6 59839.2 59898.6 60121.9 60210.0 60264.8 60423.7 60575.1 60683.1 60735.5 60800.8 60826.8 60849.9 60915.2 60996.7 61026.4 61075.4 61146.4 61255.0 61282.5 61309.8 61316.8 61422.6 61466.4 61517.3 61654.2 61726.9 61829.9 61938.7 62009.3 62079.1 62312.8 62344.6 62380.1 62517.3 62645.5 62687.7 62808.6 62886.9 63028.1 63131.0 63313.5 63380.7 63420.4 63485.1 63530.7 63742.3 63773.8 63815.9 63901.9 63957.0 64026.6 64149.4 64176.0 64244.7 64311.1 64355.9 64414.4 64486.0 64602.1 64630.0 64674.5 64700.8 64767.0 64819.5 64947.6 64953.8 65026.2 65078.6 65103.5 65235.7 65299.2 65364.4 65453.2 65482.5 65539.5 65559.2 65659.8 65725.7 65797.8 65835.7
energy: -1930.164358435788
dipole: 4.22515 -3.45680 0.76836 -1.37516 -0.65906 -2.03421 12.16990 -11.28099 0.88891
magnitude: 2.34916 au
magnitude: 5.97109 debye
