program: Orca
programVersion: 5.0.4
elementType: S S O N N O O C C C C C C C C C C N N C N C C N C C H H H H H H H H H H H H H H H H
keywords: PBE0 ma-def2-TZVP AutoAux D4 VeryTightSCF TightOPT
charge: 2
multiplicity: 1
formula: C15H16N6O3S2
InChI: InChI=1/C15H16N6O3S2/c16-10-8(12(23)20-14(25)18-10)7(5-1-3-6(22)4-2-5)9-11(17)19-15(26)21-13(9)24/h1-4,7,18-22H,16-17H3
42 atoms
S  3.625136 -1.777158 -4.162844
S  -5.57903 0.50583 -1.414405
O  1.730738 0.617067 5.32401
N  0.338388 -3.882714 -1.041886
N  -1.044409 1.462632 0.439611
O  1.145734 0.827719 -0.861216
O  -2.199199 -2.989202 -0.872308
C  -0.218978 -1.437997 0.420225
C  2.184248 -0.129765 3.085826
C  1.697479 -0.612237 1.881678
C  1.31178 0.135476 4.133615
C  0.340275 -0.836465 1.696335
C  -0.048608 -0.105274 3.97051
C  -0.520049 -0.59447 2.76645
C  -1.530169 -0.866161 -0.05916
C  -2.452053 -1.801685 -0.667397
C  -1.922186 0.423854 -0.024878
N  -3.671644 -1.29967 -1.037455
N  -3.139436 0.835083 -0.445385
C  -4.082763 -0.00712 -0.94746
N  1.864912 -2.738705 -2.436079
C  2.549839 -1.664728 -2.918806
C  1.011334 -2.658186 -1.394014
N  2.251237 -0.498863 -2.287131
C  0.745226 -1.51181 -0.732748
C  1.363203 -0.31665 -1.258938
H  0.450434 -4.613067 -1.752483
H  -0.697092 -3.667901 -0.930299
H  -0.073857 1.268797 0.02963
H  -1.346867 2.39388 0.13444
H  -0.471593 -2.463605 0.698692
H  3.24946 0.040241 3.208901
H  2.409418 -0.824032 1.09261
H  -0.72948 0.082778 4.792508
H  -1.582393 -0.794169 2.666073
H  2.702174 0.336791 -2.644624
H  2.030264 -3.630492 -2.892839
H  -3.391812 1.816708 -0.380111
H  -4.328269 -1.95597 -1.446737
H  -0.975121 1.476685 1.465697
H  0.693644 -4.265604 -0.156012
H  2.690186 0.726357 5.307964
totalener: -1930.50223935 hartree
nucrepener: 2729.22110046 hartree
electener: -4659.72333980 hartree
oneelecener: -8020.39464640 hartree
twoeener: 3360.67130659 hartree
cpcmener: -0.36739838 hartree
kineticenergy: 1924.14883362 hartree
exchangeener: -147.861913386700 hartree
correlationener: -7.073384180513 hartree
xcener: -154.935297567214 hartree
elementType: S O N C H
chargesum: 2.0000000
charge: -0.464853 -0.471923 -0.412898 -0.392895 -0.361642 -0.439497 -0.479607 -1.430564 -0.296877 -0.162098 0.402792 -0.229971 -0.155342 -0.109007 1.033105 0.016860 0.059935 -0.156412 -0.156820 0.145513 -0.117655 0.175798 -0.043419 -0.162911 0.669772 0.485131 0.388439 0.357411 0.364598 0.387949 0.244905 0.185637 0.205682 0.189851 0.192297 0.333705 0.346402 0.345372 0.332547 0.402957 0.410244 0.367489
charge: 0.239008 0.233035 0.009201 0.177829 0.170009 0.011891 -0.003567 -0.140154 -0.131714 -0.115695 -0.291329 -0.181861 -0.122450 -0.128988 -0.082590 -0.329264 -0.189959 0.158967 0.156088 -0.595424 0.158039 -0.594772 -0.179799 0.159414 -0.083567 -0.337681 0.271937 0.250050 0.248561 0.271876 0.249248 0.201556 0.214127 0.202553 0.214654 0.278393 0.280713 0.280516 0.277571 0.275286 0.280486 0.237810
qa: -0.4649 -0.4719 -0.4129 -0.3929 -0.3616 -0.4395 -0.4796 -1.4306 -0.2969 -0.1621 0.4028 -0.2300 -0.1553 -0.1090 1.0331 0.0169 0.0599 -0.1564 -0.1568 0.1455 -0.1177 0.1758 -0.0434 -0.1629 0.6698 0.4851 0.3884 0.3574 0.3646 0.3879 0.2449 0.1856 0.2057 0.1899 0.1923 0.3337 0.3464 0.3454 0.3325 0.4030 0.4102 0.3675
va: 1.7852 1.7807 1.9605 3.4214 3.4188 1.9439 1.9545 4.7795 4.4998 4.6727 3.7469 5.1725 4.1378 3.9232 2.5121 4.2816 4.3351 3.2700 3.2944 4.0966 3.2072 4.0313 4.3204 3.3368 1.8334 3.8292 0.8579 0.9306 0.9282 0.8564 0.8969 0.9622 0.9275 0.9520 0.9426 0.8968 0.8855 0.8883 0.8977 0.8287 0.8282 0.8780
energy: -1930.572142627495
dipole: 4.22515 -3.44588 0.77927 -1.37516 -0.64668 -2.02183 12.16990 -11.32148 0.84842
magnitude: 2.32699 au
magnitude: 5.91474 debye
