program: Orca
programVersion: 5.0.4
elementType: S S O N N O O C C C C C C C C C C N N C N C C N C C H H H H H H H H H H H H H H
keywords: PBE0 ma-def2-TZVP AutoAux D4 VeryTightSCF TightOPT
charge: 0
multiplicity: 1
formula: C15H14N6O3S2
InChI: InChI=1/C15H14N6O3S2/c16-10-8(12(23)20-14(25)18-10)7(5-1-3-6(22)4-2-5)9-11(17)19-15(26)21-13(9)24/h1-4,7,18-22H,16-17H2
40 atoms
S  4.181933 -4.104905 -2.096994
S  -5.746731 -1.532318 -1.406667
O  1.235232 4.133171 2.585564
N  1.057979 -0.313941 -1.914865
N  -1.958385 -3.240071 1.226594
O  0.953991 -3.561647 1.547155
O  -1.434818 0.767155 -1.279677
C  -0.150008 -1.053403 0.711642
C  1.91095 2.054293 1.565659
C  1.554684 0.799808 1.089762
C  0.943953 2.886038 2.10865
C  0.241121 0.354182 1.13762
C  -0.374616 2.452259 2.181303
C  -0.711989 1.199878 1.701674
C  -1.527186 -1.161081 0.097365
C  -2.042783 -0.208396 -0.807014
C  -2.332796 -2.238124 0.433038
N  -3.366157 -0.378084 -1.207969
N  -3.61129 -2.312248 -0.053483
C  -4.177702 -1.393585 -0.867274
N  2.436708 -2.136291 -1.842178
C  2.955221 -3.276296 -1.334592
C  1.436895 -1.401378 -1.256732
N  2.395113 -3.680932 -0.180219
C  0.911185 -1.812084 -0.042729
C  1.377886 -3.025694 0.507621
H  2.824514 -1.817876 -2.721458
H  -4.185679 -3.105961 0.199229
H  1.450248 -0.112133 -2.820834
H  0.229623 0.206504 -1.616456
H  -0.978693 -3.365844 1.470696
H  -2.586782 -4.012524 1.386408
H  2.733742 -4.542298 0.228547
H  -3.734289 0.319323 -1.841732
H  -0.219977 -1.590507 1.662672
H  2.942578 2.387662 1.514933
H  2.329175 0.162194 0.679423
H  -1.128007 3.101471 2.612954
H  -1.745584 0.87629 1.765959
H  2.178299 4.305344 2.474177
totalener: -1929.65410086 hartree
nucrepener: 2662.14576882 hartree
electener: -4591.79986968 hartree
oneelecener: -7938.51516190 hartree
twoeener: 3346.71529223 hartree
cpcmener: -0.08153164 hartree
kineticenergy: 1923.66968225 hartree
exchangeener: -147.773095114393 hartree
correlationener: -7.070250416741 hartree
xcener: -154.843345531133 hartree
elementType: S O N C H
chargesum: 0.0000000
charge: -0.564759 -0.563178 -0.480346 -0.510676 -0.598602 -0.670341 -0.596207 -0.752181 -0.322254 0.069302 0.488562 -0.582026 -0.272072 0.017551 0.838112 0.385626 0.156220 -0.196951 -0.147304 0.190312 -0.162638 0.174526 0.288912 -0.224183 -0.137539 0.251088 0.324528 0.323032 0.328300 0.330311 0.321467 0.331665 0.320035 0.322073 0.172294 0.177983 0.199196 0.181231 0.192725 0.396205
charge: 0.143012 0.143399 -0.030555 0.026926 0.019205 -0.109524 -0.088125 -0.153893 -0.146033 -0.131471 -0.292601 -0.169072 -0.138898 -0.122287 -0.131974 -0.380088 -0.252437 0.129364 0.133747 -0.614401 0.131672 -0.613707 -0.264623 0.127978 -0.137365 -0.378435 0.269273 0.268886 0.232918 0.229949 0.226026 0.232379 0.267364 0.268000 0.243096 0.198474 0.210481 0.199046 0.209382 0.244910
qa: -0.5648 -0.5632 -0.4803 -0.5107 -0.5986 -0.6703 -0.5962 -0.7522 -0.3223 0.0693 0.4886 -0.5820 -0.2721 0.0176 0.8381 0.3856 0.1562 -0.1970 -0.1473 0.1903 -0.1626 0.1745 0.2889 -0.2242 -0.1375 0.2511 0.3245 0.3230 0.3283 0.3303 0.3215 0.3317 0.3200 0.3221 0.1723 0.1780 0.1992 0.1812 0.1927 0.3962
va: 1.6503 1.6541 1.8837 2.9596 3.1298 1.7167 1.6916 3.6533 4.4780 3.8132 3.5611 5.5711 4.2479 3.7680 1.2685 4.0903 4.2877 3.2628 3.1791 4.0138 3.2100 4.0585 4.1286 3.2703 3.5851 4.0810 0.9032 0.9029 0.9081 0.9283 0.9232 0.9061 0.9063 0.9039 0.9420 0.9648 0.9370 0.9588 0.9320 0.8550
energy: -1929.724267334132
dipole: 2.85336 -2.32468 0.52868 7.03248 -7.21962 -0.18714 5.83482 -5.87367 -0.03885
magnitude: 0.56217 au
magnitude: 1.42891 debye
