program: Orca
programVersion: 5.0.4
elementType: S S O N N O O C C C C C C C C C C N N C N C C N C C H H H H H H H H H H H H H H H H
keywords: PBE0 ma-def2-TZVP AutoAux D4 VeryTightSCF TightOPT
charge: 2
multiplicity: 1
formula: C15H16N6O3S2
InChI: InChI=1/C15H16N6O3S2/c16-10-8(12(23)20-14(25)18-10)7(5-1-3-6(22)4-2-5)9-11(17)19-15(26)21-13(9)24/h1-4,7,18-24H,16-17H2
42 atoms
S  3.442533 -2.191504 -4.357084
S  -5.533322 1.175369 -1.261398
O  1.558373 0.080214 5.333071
N  1.511817 -3.602829 -0.043545
N  -0.965334 1.448112 0.601036
O  0.447715 0.681124 -1.875286
O  -2.588864 -2.663559 -1.212124
C  -0.329516 -1.428737 0.223328
C  1.955741 -0.04216 2.966528
C  1.479962 -0.423369 1.721425
C  1.176189 -0.250607 4.102649
C  0.223968 -1.006169 1.578541
C  -0.084321 -0.845892 3.970504
C  -0.545668 -1.215969 2.727765
C  -1.621204 -0.725639 -0.168452
C  -2.638287 -1.41423 -0.824588
C  -1.903618 0.621205 0.098469
N  -3.802072 -0.831106 -1.139939
N  -3.091333 1.150268 -0.239446
C  -4.131501 0.48557 -0.877949
N  2.34101 -2.812752 -2.031844
C  2.500497 -1.916307 -3.079994
C  1.529783 -2.647411 -0.970383
N  1.789709 -0.753184 -2.864071
C  0.710712 -1.500668 -0.877793
C  0.958992 -0.523831 -1.832087
H  2.108449 -4.412619 -0.116926
H  -1.748252 -3.090085 -1.007079
H  0.057994 0.983304 -1.034239
H  -1.222815 2.395192 0.84296
H  -0.642989 -2.472006 0.379809
H  2.938882 0.4077 3.054268
H  2.112224 -0.260953 0.854457
H  -0.675998 -1.014963 4.86199
H  -1.524923 -1.679523 2.650005
H  1.932915 -0.01034 -3.539289
H  2.925794 -3.635983 -2.11204
H  -3.299674 2.120115 -0.033242
H  -4.508169 -1.382949 -1.616112
H  -0.27257 1.017915 1.21343
H  1.156155 -3.400264 0.877689
H  2.442374 0.464025 5.350676
totalener: -1930.20665780 hartree
nucrepener: 2712.00917117 hartree
electener: -4642.21582897 hartree
oneelecener: -7988.85951412 hartree
twoeener: 3346.64368515 hartree
kineticenergy: 1924.23370879 hartree
exchangeener: -147.897469641824 hartree
correlationener: -7.074305840453 hartree
xcener: -154.971775482277 hartree
chargesum: 2.0000000
charge: -0.156836 -0.147782 -0.311684 -0.443678 -0.406842 -0.228415 -0.237044 0.926342 -0.535901 0.693333 0.587964 -0.859936 -0.290588 0.171412 -1.419675 0.141493 0.561580 -0.161461 -0.163175 -0.032117 -0.126903 -0.029032 0.357770 -0.158483 -0.696152 0.506071 0.301331 0.364118 0.392691 0.299697 0.180271 0.166254 0.177828 0.191836 0.171401 0.310749 0.284900 0.285325 0.312093 0.348470 0.320482 0.352294
charge: 0.476587 0.488916 0.080726 0.041625 0.007749 0.136092 0.156546 -0.184784 -0.118407 -0.159523 -0.272414 -0.242901 -0.079139 -0.128622 -0.133861 -0.272032 -0.262582 0.163967 0.143373 -0.622704 0.138203 -0.626195 -0.252808 0.156507 -0.141316 -0.288172 0.229396 0.248709 0.245837 0.230300 0.227298 0.198718 0.207515 0.208790 0.204942 0.274149 0.263046 0.264387 0.276143 0.243239 0.234137 0.238559
qa: -0.1568 -0.1478 -0.3117 -0.4437 -0.4068 -0.2284 -0.2370 0.9263 -0.5359 0.6933 0.5880 -0.8599 -0.2906 0.1714 -1.4197 0.1415 0.5616 -0.1615 -0.1632 -0.0321 -0.1269 -0.0290 0.3578 -0.1585 -0.6962 0.5061 0.3013 0.3641 0.3927 0.2997 0.1803 0.1663 0.1778 0.1918 0.1714 0.3107 0.2849 0.2853 0.3121 0.3485 0.3205 0.3523
va: 2.1322 2.1461 2.1219 3.1513 3.0024 2.2724 2.2987 1.1216 4.5213 2.5721 3.3795 3.6218 4.3246 3.8165 4.1002 4.0861 3.2283 3.1707 3.2723 4.3420 3.1152 4.3611 3.9153 3.2317 4.0918 3.6136 0.9269 0.9000 0.8556 0.9322 0.8938 0.9680 0.9437 0.9533 0.9483 0.9177 0.9355 0.9368 0.9174 0.9033 0.9146 0.8896
energy: -1930.272379973399
dipole: 6.08395 -5.23566 0.84828 -1.38214 0.79747 -0.58467 14.28481 -13.26359 1.02122
magnitude: 1.45062 au
magnitude: 3.68719 debye
