program: Orca
programVersion: 5.0.4
elementType: S S O N N O O C C C C C C C C C C N N C N C C N C C H H H H H H H H H H H H H H
keywords: PBE0 aug-cc-pVDZ AutoAux D4 VeryTightSCF
charge: 0
multiplicity: 1
formula: C15H14N6O3S2
InChI: InChI=1/C15H14N6O3S2/c16-10-8(12(23)20-14(25)18-10)7(5-1-3-6(22)4-2-5)9-11(17)19-15(26)21-13(9)24/h1-4,7,18-22H,16-17H2
40 atoms
S  -4.20979 -4.08823 -2.12517
S  5.77661 -1.51131 -1.31927
O  -1.20585 4.12782 2.58318
N  -1.14078 -0.24636 -1.87796
N  1.96979 -3.20086 1.31207
O  -0.87898 -3.63161 1.4393
O  1.40898 0.68937 -1.36526
C  0.13632 -1.06038 0.69504
C  -1.90898 2.0396 1.61534
C  -1.56224 0.78474 1.13383
C  -0.92778 2.88817 2.10833
C  -0.24371 0.35024 1.12545
C  0.39612 2.46367 2.12479
C  0.72368 1.21054 1.63958
C  1.5202 -1.17506 0.09843
C  2.02545 -0.24559 -0.84368
C  2.34084 -2.22112 0.48547
N  3.36335 -0.40651 -1.21223
N  3.63041 -2.28356 0.0251
C  4.19086 -1.38604 -0.81452
N  -2.48588 -2.10173 -1.84293
C  -2.97319 -3.2662 -1.3633
C  -1.48364 -1.36959 -1.25664
N  -2.3762 -3.70258 -0.2412
C  -0.92575 -1.80891 -0.06845
C  -1.34549 -3.06082 0.4458
H  -2.89847 -1.76106 -2.70246
H  4.21552 -3.05678 0.31441
H  -1.53652 -0.03483 -2.78082
H  -0.27167 0.2314 -1.61553
H  0.97844 -3.36755 1.48922
H  2.60606 -3.96187 1.49664
H  -2.69027 -4.58548 0.14018
H  3.73023 0.27168 -1.86718
H  0.19137 -1.6039 1.64375
H  -2.94763 2.35748 1.60641
H  -2.34886 0.13643 0.76603
H  1.16339 3.12161 2.51756
H  1.76242 0.89882 1.66297
H  -2.15516 4.28804 2.51443
elementType: S O N C H
totalener: -1929.39649644 hartree
nucrepener: 2658.24104392 hartree
electener: -4587.63754036 hartree
oneelecener: -7929.33004582 hartree
twoeener: 3341.69250546 hartree
cpcmener: -0.06231014 hartree
kineticenergy: 1922.23500041 hartree
exchangeener: -147.660384005863 hartree
correlationener: -7.081778335690 hartree
xcener: -154.742162341553 hartree
chargesum: -0.0000000
charge: -0.317865 -0.315718 -0.750590 -0.128445 -0.190551 -0.919039 -0.991564 1.212411 -0.438834 0.921793 0.115096 1.403318 -0.144057 1.612766 1.375410 0.344040 0.551624 -0.429373 -0.504891 0.461366 -0.335913 0.451800 -0.450098 -0.493521 1.080734 0.813998 -0.010421 0.025949 -0.055666 0.049304 -0.035779 -0.021557 0.023555 0.000548 -0.533914 -0.867640 -0.959999 -0.750375 -1.031878 0.233976
charge: 0.464396 0.464977 0.229424 0.372798 0.369868 0.094508 0.113188 -0.086049 0.047888 0.041592 -0.282502 -0.146221 0.044560 0.043125 -0.045623 -0.332821 -0.178668 0.155623 0.165259 -0.716064 0.165866 -0.715853 -0.191653 0.154922 -0.052030 -0.333691 0.053631 0.053876 0.032056 -0.101261 -0.090950 0.031588 0.045112 0.044482 0.035617 0.021375 0.016838 0.018849 0.024598 -0.032630
qa: -0.3179 -0.3157 -0.7506 -0.1284 -0.1906 -0.9190 -0.9916 1.2124 -0.4388 0.9218 0.1151 1.4033 -0.1441 1.6128 1.3754 0.3440 0.5516 -0.4294 -0.5049 0.4614 -0.3359 0.4518 -0.4501 -0.4935 1.0807 0.8140 -0.0104 0.0259 -0.0557 0.0493 -0.0358 -0.0216 0.0236 0.0005 -0.5339 -0.8676 -0.9600 -0.7504 -1.0319 0.2340
va: 1.6802 1.6830 1.2139 2.9576 3.0330 1.3068 1.4162 0.0184 3.1868 -2.4050 3.5621 5.7243 2.0703 -4.1238 1.2736 1.9921 -2.3488 2.7102 2.7733 3.0473 2.6273 3.0604 0.8217 2.8045 2.3968 -0.7009 0.8426 0.8276 0.8566 0.8331 0.9702 0.8321 0.8573 0.8600 0.6302 0.1846 -0.3284 0.3427 -0.3671 0.9172
energy: 33372.8 33417.1 33772.5 36174.2 36765.5 36807.5 38114.9 38859.0 39015.4 39569.3 40140.8 40469.2 40548.4 40827.5 41231.7 41361.8 41556.2 41828.3 42613.1 42662.4 42775.0 42822.6 42901.5 42984.0 43338.6 44104.2 44971.6 45016.9 45125.8 45294.2 45362.9 45486.9 45688.0 45794.7 45922.2 46142.0 46179.4 46324.7 46553.2 46608.4 46786.1 47110.3 47244.6 47286.0 47434.3 47821.3 47930.2 47951.1 48055.1 48163.9 48411.1 48568.7 48679.1 48837.1 48893.7 49123.1 49210.0 49408.1 49520.4 49765.8 49774.4 49789.8 49845.4 49900.7 50068.6 50150.1 50188.3 50309.5 50396.2 50403.0 50558.8 50727.7 50823.1 51001.2 51095.5 51222.4 51378.6 51459.1 51540.1 51576.5 51593.8 51695.6 51838.9 52069.2 52308.5 52497.3 52594.2 52647.3 52795.3 52820.4 53081.2 53173.7 53467.2 53548.4 53600.5 53689.3 53737.5 53874.1 53888.4 54095.3 54135.4 54189.6 54308.0 54410.5 54516.9 54546.5 54605.2 54619.5 54783.6 54828.2 54845.2 54878.1 54939.1 54956.2 55077.9 55200.4 55232.8 55272.8 55310.3 55513.6 55559.1 55622.2 55655.1 55699.6 55796.1 56030.5 56086.3 56176.9 56253.8 56348.5 56424.5 56622.5 56706.1 56732.1 56938.4 57132.6 57240.3 57394.0 57456.9 57509.0 57569.8 57635.0 57747.6 57882.9 57947.6 58017.8 58088.8 58174.4 58247.2 58269.3 58372.4 58438.9 58469.7 58550.7 58651.9 58695.9 58719.9 58849.2 58855.9 58916.4 59035.4 59162.5 59227.0 59293.2 59354.0 59370.3 59478.5 59550.0 59582.3 59600.1 59666.0 59718.0 59829.4 59888.0 59931.4 60024.2 60212.0 60364.8 60497.7 60583.2 60623.0 60672.4 60732.3 60778.4 60797.0 60923.2 60993.2 61001.1 61119.4 61326.2 61365.5 61394.4 61448.2 61528.1 61599.4 61661.1 61733.6 61756.2 61844.0 61896.1
energy: -1929.302894324278
dipole: -2.93105 2.37727 -0.55378 7.13903 -7.07097 0.06806 6.02231 -5.74518 0.27713
magnitude: 0.62298 au
magnitude: 1.58350 debye
