program: Orca
programVersion: 5.0.4
elementType: S S O N N O O C C C C C C C C C C N N C N C C N C C H H H H H H H H H H
keywords: PBE0 ma-def2-TZVP AutoAux D4 VeryTightSCF TightOPT
charge: -4
multiplicity: 1
formula: C15H10N6O3S2
InChI: InChI=1/C15H10N6O3S2/c16-10-8(12(23)20-14(25)18-10)7(5-1-3-6(22)4-2-5)9-11(17)19-15(26)21-13(9)24/h1-4,7,22H,16-17H2
36 atoms
S  3.842221 -1.513224 -4.06532
S  -5.797568 0.035965 -1.058606
O  1.735517 0.480432 5.415899
N  0.140263 -3.512843 -1.487767
N  -1.11444 1.351813 -0.235137
O  1.631513 0.876424 -0.383158
O  -2.319791 -3.237077 0.119775
C  -0.165804 -1.386971 0.382438
C  2.138423 -0.664948 3.327794
C  1.656323 -1.084161 2.099364
C  1.305063 0.033707 4.192864
C  0.347084 -0.825501 1.697844
C  -0.004167 0.294091 3.822455
C  -0.46992 -0.138193 2.587122
C  -1.578941 -0.994074 0.014487
C  -2.58242 -1.992575 -0.08153
C  -1.983172 0.304521 -0.289183
N  -3.858553 -1.656554 -0.403831
N  -3.248695 0.622772 -0.621579
C  -4.14696 -0.374076 -0.65468
N  1.814641 -2.464254 -2.646167
C  2.6399 -1.415546 -2.800032
C  0.931184 -2.402314 -1.635959
N  2.591823 -0.308175 -2.052611
C  0.829304 -1.32036 -0.762459
C  1.681652 -0.222939 -1.046226
H  0.133794 -4.128687 -2.284625
H  -0.737906 -3.430829 -0.978595
H  -0.105211 1.170482 -0.238498
H  -1.43197 2.193679 -0.68697
H  -0.256774 -2.455159 0.604776
H  3.162834 -0.874154 3.621198
H  2.319908 -1.620798 1.428914
H  -0.655226 0.834864 4.500655
H  -1.497783 0.068675 2.311534
H  2.658753 0.227647 5.535153
totalener: -1927.71143604 hartree
nucrepener: 2555.81302344 hartree
electener: -4483.52445949 hartree
oneelecener: -7823.70202251 hartree
twoeener: 3340.17756302 hartree
cpcmener: -0.93524425 hartree
kineticenergy: 1921.58272599 hartree
exchangeener: -147.300192938184 hartree
correlationener: -7.055200400357 hartree
xcener: -154.355393338541 hartree
elementType: S O N C H
chargesum: -4.0000000
charge: -0.926998 -0.930310 -0.490144 -0.675509 -0.593245 -0.830337 -0.889623 -0.629757 -0.383375 0.186648 0.471254 -0.851928 -0.286610 0.242003 0.232353 0.279935 0.008806 -0.713682 -0.686712 0.422705 -0.689152 0.464812 -0.065598 -0.660465 1.286874 0.287289 0.290483 0.293815 0.301468 0.286421 0.126058 0.174929 0.184909 0.174831 0.194167 0.393685
charge: -0.200138 -0.200519 -0.042768 -0.104941 -0.091950 -0.264090 -0.296827 -0.182872 -0.157737 -0.133217 -0.300600 -0.171373 -0.152044 -0.142308 -0.179317 -0.460080 -0.357625 -0.086133 -0.078499 -0.690183 -0.078115 -0.689581 -0.347932 -0.079664 -0.173210 -0.459080 0.209857 0.207305 0.212078 0.210170 0.233126 0.196296 0.205609 0.196228 0.207655 0.242478
qa: -0.9270 -0.9303 -0.4901 -0.6755 -0.5932 -0.8303 -0.8896 -0.6298 -0.3834 0.1866 0.4713 -0.8519 -0.2866 0.2420 0.2324 0.2799 0.0088 -0.7137 -0.6867 0.4227 -0.6892 0.4648 -0.0656 -0.6605 1.2869 0.2873 0.2905 0.2938 0.3015 0.2864 0.1261 0.1749 0.1849 0.1748 0.1942 0.3937
va: 1.1169 1.1162 1.8623 2.9796 2.7999 1.4410 1.4315 3.4744 4.5495 3.2630 3.5707 5.1895 4.1289 3.5723 2.2959 3.9278 4.3977 2.6788 2.6060 3.6122 2.6128 3.5019 4.2761 2.6862 -0.1052 4.0496 0.9329 0.9344 0.9424 0.9349 0.9740 0.9645 0.9339 0.9618 0.9355 0.8570
energy: -1927.790246882279
dipole: 5.52760 -1.29320 4.23440 0.13971 0.29901 0.43872 14.16139 -4.41857 9.74282
magnitude: 10.63227 au
magnitude: 27.02509 debye
