program: Orca
programVersion: 5.0.4
elementType: S S O N N O O C C C C C C C C C C N N C N C C N C C H H H H H H H H H H H H H H
keywords: PBE0 ma-def2-TZVP AutoAux D4 VeryTightSCF TightOPT
charge: 0
multiplicity: 1
formula: C15H14N6O3S2
InChI: InChI=1/C15H14N6O3S2/c16-10-8(12(23)20-14(25)18-10)7(5-1-3-6(22)4-2-5)9-11(17)19-15(26)21-13(9)24/h1-4,7,18-22H,16-17H2
40 atoms
S  4.219436 -4.032257 -2.159555
S  -5.793241 -1.550493 -1.248905
O  1.1925 4.12421 2.583066
N  1.19818 -0.158697 -1.836672
N  -1.976696 -3.177428 1.411079
O  0.791751 -3.682939 1.318639
O  -1.400216 0.58649 -1.436221
C  -0.137284 -1.062987 0.690994
C  1.906031 2.002688 1.690082
C  1.559993 0.751889 1.203317
C  0.918488 2.884467 2.104054
C  0.234028 0.352792 1.11268
C  -0.412941 2.496811 2.033762
C  -0.740264 1.246349 1.546485
C  -1.528507 -1.199876 0.119657
C  -2.027882 -0.307871 -0.870398
C  -2.351636 -2.221117 0.545694
N  -3.369279 -0.464399 -1.221556
N  -3.645537 -2.289306 0.096172
C  -4.219057 -1.415831 -0.779333
N  2.519484 -2.040268 -1.837886
C  2.98881 -3.241623 -1.399112
C  1.512517 -1.315243 -1.249116
N  2.341929 -3.709152 -0.309265
C  0.921201 -1.791984 -0.096672
C  1.302473 -3.079797 0.370945
H  2.977487 -1.694561 -2.666836
H  -4.257716 -3.026677 0.408913
H  1.602482 0.070897 -2.727139
H  0.300329 0.287587 -1.602285
H  -0.976314 -3.379526 1.521479
H  -2.608524 -3.933838 1.605929
H  2.62728 -4.612491 0.039132
H  -3.730117 0.189532 -1.900865
H  -0.162009 -1.612696 1.637335
H  2.952047 2.289733 1.747993
H  2.348475 0.074899 0.896337
H  -1.180623 3.186261 2.363258
H  -1.785371 0.96157 1.505547
H  2.143603 4.262919 2.582926
totalener: -1929.60656660 hartree
nucrepener: 2660.86842372 hartree
electener: -4590.47499032 hartree
oneelecener: -7937.20218296 hartree
twoeener: 3346.72719264 hartree
kineticenergy: 1923.53725336 hartree
exchangeener: -147.742113970544 hartree
correlationener: -7.069579469322 hartree
xcener: -154.811693439865 hartree
chargesum: 0.0000000
charge: -0.423603 -0.421706 -0.377372 -0.397505 -0.477774 -0.539567 -0.450444 -1.243225 -0.185376 -0.137819 0.330387 0.188478 -0.144738 -0.211592 0.595023 0.290541 0.346376 -0.158490 -0.163023 0.074800 -0.170025 0.052541 0.200224 -0.176096 0.094643 0.309976 0.249472 0.246395 0.241796 0.330524 0.324083 0.244621 0.271003 0.273811 0.149793 0.112989 0.144398 0.140075 0.142725 0.323683
charge: 0.240690 0.242445 0.005467 0.002188 -0.016552 -0.041930 -0.015169 -0.153244 -0.151441 -0.123572 -0.287834 -0.163271 -0.120265 -0.111058 -0.136230 -0.386303 -0.270124 0.118233 0.103452 -0.633686 0.102938 -0.633151 -0.280186 0.118355 -0.139700 -0.382027 0.246085 0.245544 0.206995 0.232866 0.224624 0.204691 0.254604 0.255519 0.240426 0.183863 0.201834 0.193045 0.201859 0.220020
qa: -0.4236 -0.4217 -0.3774 -0.3975 -0.4778 -0.5396 -0.4504 -1.2432 -0.1854 -0.1378 0.3304 0.1885 -0.1447 -0.2116 0.5950 0.2905 0.3464 -0.1585 -0.1630 0.0748 -0.1700 0.0525 0.2002 -0.1761 0.0946 0.3100 0.2495 0.2464 0.2418 0.3305 0.3241 0.2446 0.2710 0.2738 0.1498 0.1130 0.1444 0.1401 0.1427 0.3237
va: 1.8510 1.8538 1.9672 2.9088 3.0547 1.8993 1.8725 3.0778 4.3023 4.0477 3.8931 5.0655 3.9912 4.3681 1.0443 4.2454 3.9022 3.1541 3.0780 4.2322 3.0999 4.2841 4.2591 3.1513 3.3687 3.9278 0.9570 0.9578 0.9525 0.9693 0.9569 0.9538 0.9420 0.9395 0.9429 0.9766 0.9481 0.9663 0.9421 0.9072
energy: -1929.671006590851
dipole: 3.06367 -2.59344 0.47022 7.29065 -7.11318 0.17747 6.26398 -6.06891 0.19507
magnitude: 0.53913 au
magnitude: 1.37035 debye
