program: Orca
programVersion: 5.0.4
elementType: S S O N N O O C C C C C C C C C C N N C N C C N C C H H H H H H H H H H H H H H
keywords: PBE0 aug-cc-pVDZ AutoAux D4 VeryTightSCF
charge: 0
multiplicity: 1
formula: C15H14N6O3S2
InChI: InChI=1/C15H14N6O3S2/c16-10-8(12(23)20-14(25)18-10)7(5-1-3-6(22)4-2-5)9-11(17)19-15(26)21-13(9)24/h1-4,7,18-22H,16-17H2
40 atoms
S  -4.18705 -4.10434 -2.11124
S  5.7542 -1.52245 -1.38171
O  -1.22074 4.13478 2.58294
N  -1.08966 -0.28939 -1.90318
N  1.96472 -3.2274 1.2556
O  -0.93899 -3.57777 1.51742
O  1.42466 0.74738 -1.29764
C  0.14312 -1.05389 0.70769
C  -1.91057 2.05485 1.58055
C  -1.55803 0.79968 1.10373
C  -0.93863 2.89173 2.10804
C  -0.24321 0.35557 1.1351
C  0.38134 2.45854 2.16446
C  0.71493 1.20525 1.68447
C  1.52268 -1.16541 0.09911
C  2.03587 -0.21952 -0.81506
C  2.33549 -2.23251 0.45129
N  3.36101 -0.38631 -1.21024
N  3.61696 -2.30057 -0.02798
C  4.18031 -1.38903 -0.85188
N  -2.45226 -2.12636 -1.84479
C  -2.96037 -3.2753 -1.34695
C  -1.45409 -1.39014 -1.2586
N  -2.38958 -3.68734 -0.20086
C  -0.91851 -1.80881 -0.05089
C  -1.37291 -3.03326 0.4881
H  -2.84786 -1.80183 -2.71859
H  4.19668 -3.08692 0.23626
H  -1.48171 -0.0815 -2.80835
H  -0.25062 0.22172 -1.61662
H  0.98285 -3.36824 1.48519
H  2.59704 -3.99402 1.42968
H  -2.71898 -4.55563 0.20181
H  3.72609 0.30808 -1.84976
H  0.20724 -1.59316 1.65817
H  -2.94438 2.38419 1.54195
H  -2.33793 0.15964 0.70752
H  1.13944 3.11052 2.58474
H  1.7502 0.88461 1.73904
H  -2.16423 4.31537 2.48829
elementType: S O N C H
totalener: -1929.39884427 hartree
nucrepener: 2658.62034686 hartree
electener: -4588.01919112 hartree
oneelecener: -7930.25921564 hartree
twoeener: 3342.24002452 hartree
cpcmener: -0.07886803 hartree
kineticenergy: 1922.21561618 hartree
exchangeener: -147.664374915535 hartree
correlationener: -7.081352146914 hartree
xcener: -154.745727062449 hartree
chargesum: 0.0000000
charge: -0.311090 -0.308287 -0.805075 -0.128003 -0.212602 -0.959077 -1.033493 1.158124 -0.481623 0.989740 0.177381 1.466408 -0.134240 1.565912 1.416750 0.397547 0.558284 -0.443070 -0.515772 0.469009 -0.331093 0.447921 -0.449235 -0.503826 0.940531 0.884321 -0.008614 0.028866 -0.064280 0.057235 -0.019980 -0.025342 0.025470 0.005527 -0.538165 -0.854067 -0.958791 -0.749303 -1.029628 0.275631
charge: 0.474072 0.474660 0.215941 0.377298 0.375272 0.059245 0.080294 -0.085257 0.051229 0.042924 -0.280467 -0.149372 0.043818 0.039947 -0.043660 -0.337760 -0.173828 0.156463 0.167524 -0.715152 0.167950 -0.715009 -0.187484 0.155709 -0.052204 -0.339464 0.054555 0.054965 0.034997 -0.096990 -0.079200 0.034663 0.047220 0.046776 0.035878 0.022812 0.016561 0.019519 0.026203 -0.020648
qa: -0.3111 -0.3083 -0.8051 -0.1280 -0.2126 -0.9591 -1.0335 1.1581 -0.4816 0.9897 0.1774 1.4664 -0.1342 1.5659 1.4167 0.3975 0.5583 -0.4431 -0.5158 0.4690 -0.3311 0.4479 -0.4492 -0.5038 0.9405 0.8843 -0.0086 0.0289 -0.0643 0.0572 -0.0200 -0.0253 0.0255 0.0055 -0.5382 -0.8541 -0.9588 -0.7493 -1.0296 0.2756
va: 1.6898 1.6938 1.1808 2.9751 3.0370 1.2398 1.3665 0.1161 3.2178 -2.4508 3.3753 5.5396 2.1991 -3.7944 1.1234 1.8749 -2.4869 2.7614 2.7818 3.0398 2.6362 3.0767 0.8517 2.8607 2.6473 -0.8961 0.8417 0.8255 0.8545 0.8088 0.9407 0.8301 0.8580 0.8587 0.6118 0.2148 -0.3654 0.3442 -0.3440 0.8879
energy: 33232.1 33265.0 34251.6 36335.7 36784.6 37084.0 38024.9 38539.6 38850.4 39716.9 39875.0 40443.2 40676.1 41066.9 41236.1 41330.9 41544.0 41577.7 42308.2 42525.4 42666.9 43260.3 43305.2 43506.6 44052.3 44429.1 45050.2 45196.4 45336.8 45409.6 45479.1 45587.0 45746.0 45983.5 46257.0 46466.2 46585.8 46664.3 46804.8 47034.8 47076.9 47246.9 47467.3 47893.4 47938.8 48070.2 48086.9 48243.8 48267.6 48324.0 48465.8 48797.6 49161.9 49351.0 49486.2 49721.3 49785.2 49922.2 50085.2 50125.9 50219.9 50245.1 50286.2 50452.2 50499.2 50678.5 50766.8 50800.9 50951.7 50981.0 51069.7 51110.6 51447.4 51510.2 51539.0 51610.9 51870.5 51965.4 52008.2 52077.8 52090.6 52130.2 52323.5 52523.7 52813.3 53132.2 53279.3 53476.7 53616.8 53645.2 53783.9 53908.5 54049.9 54151.4 54232.6 54299.7 54326.6 54387.1 54528.0 54612.5 54687.0 54779.2 54851.2 54916.4 54984.7 55005.4 55143.6 55242.3 55298.6 55350.9 55404.6 55457.3 55481.6 55565.1 55627.8 55818.5 55850.8 55880.0 55920.9 55985.9 56043.0 56069.7 56163.6 56234.8 56380.3 56407.5 56561.7 56622.5 56736.7 56873.1 57123.7 57181.8 57293.4 57421.3 57549.0 57816.3 57881.4 57906.9 58107.7 58164.4 58279.1 58300.8 58446.9 58492.8 58520.0 58596.1 58758.1 58909.3 58924.7 58974.3 59051.4 59102.4 59186.1 59246.9 59353.8 59389.9 59412.3 59464.9 59528.1 59639.2 59710.3 59819.5 59909.2 59949.0 59975.5 60002.0 60034.9 60161.4 60213.8 60237.9 60314.1 60485.9 60519.5 60621.4 60678.6 60708.8 60829.6 60886.4 60975.0 61085.6 61135.8 61206.8 61343.0 61443.2 61574.2 61633.7 61661.0 61766.3 61826.0 61917.9 61950.0 61959.9 62067.5 62083.4 62163.7 62214.1 62380.4 62451.0 62591.7 62735.7
energy: -1929.305889738246
dipole: -2.87208 2.32321 -0.54887 7.09208 -7.18129 -0.08920 5.91790 -5.84449 0.07340
magnitude: 0.56089 au
magnitude: 1.42567 debye
