program: Orca
programVersion: 5.0.4
elementType: S S F N N O O C C C C C C C C C C N N C N C C N C C H H H H H H H H H H H H H
keywords: PBE0 ma-def2-TZVP AutoAux D4 VeryTightSCF TightOPT
charge: 0
multiplicity: 1
formula: C15H13FN6O2S2
InChI: InChI=1/C15H13FN6O2S2/c16-6-3-1-5(2-4-6)7(8-10(17)19-14(25)21-12(8)23)9-11(18)20-15(26)22-13(9)24/h1-4,7,19-22H,17-18H2
39 atoms
S  4.186357 -4.103878 -2.103659
S  -5.746127 -1.509391 -1.384452
F  1.214562 4.101388 2.571427
N  1.097797 -0.281413 -1.902216
N  -1.963448 -3.217188 1.260925
O  0.942053 -3.561417 1.525948
O  -1.414472 0.757609 -1.288976
C  -0.13873 -1.043201 0.710252
C  1.890066 2.082651 1.577249
C  1.547808 0.824562 1.097963
C  0.896719 2.875113 2.107697
C  0.236678 0.367972 1.141192
C  -0.415717 2.454341 2.184718
C  -0.733616 1.19702 1.700245
C  -1.517527 -1.157787 0.101751
C  -2.028322 -0.210468 -0.812031
C  -2.331651 -2.223607 0.454331
N  -3.351881 -0.376334 -1.210946
N  -3.612151 -2.289882 -0.027329
C  -4.173024 -1.377979 -0.852883
N  2.457746 -2.12041 -1.839431
C  2.963313 -3.269846 -1.339642
C  1.461198 -1.380937 -1.254886
N  2.392775 -3.677852 -0.191777
C  0.92635 -1.795477 -0.045472
C  1.37798 -3.020306 0.496029
H  2.852919 -1.7994 -2.714733
H  -4.193698 -3.074953 0.236789
H  1.489522 -0.07677 -2.808324
H  0.258161 0.230154 -1.618256
H  -0.982295 -3.358009 1.493316
H  -2.597109 -3.982436 1.436381
H  2.719862 -4.546496 0.212117
H  -3.715536 0.318797 -1.850531
H  -0.20035 -1.579487 1.662771
H  2.912686 2.439474 1.53893
H  2.329973 0.194072 0.692401
H  -1.171421 3.100813 2.61554
H  -1.76248 0.858929 1.759933
totalener: -1953.58910015 hartree
nucrepener: 2670.58286412 hartree
electener: -4624.17196427 hartree
oneelecener: -7990.46575426 hartree
twoeener: 3366.29379000 hartree
cpcmener: -0.06163926 hartree
kineticenergy: 1948.48182940 hartree
exchangeener: -148.970488642448 hartree
correlationener: -7.089150225572 hartree
xcener: -156.059638868020 hartree
elementType: S F N O C H
chargesum: -0.0000000
charge: -0.559544 -0.558066 -0.263384 -0.503394 -0.595337 -0.665067 -0.595976 -0.544772 -0.243177 0.067332 0.539991 -0.618156 -0.270314 -0.005901 0.884905 0.377288 0.177893 -0.193853 -0.148788 0.183613 -0.162824 0.167636 0.322444 -0.222921 -0.367468 0.246568 0.323253 0.321750 0.326527 0.331303 0.323698 0.330080 0.319477 0.321784 0.170503 0.191156 0.202505 0.192286 0.196949
charge: 0.144983 0.145583 0.071699 0.025124 0.018220 -0.104863 -0.083312 -0.151611 -0.119032 -0.120039 -0.257695 -0.156689 -0.119356 -0.111222 -0.131855 -0.381061 -0.253240 0.129836 0.133206 -0.613698 0.131285 -0.613127 -0.265032 0.128364 -0.136481 -0.378690 0.269069 0.268689 0.232482 0.229997 0.226223 0.231937 0.267663 0.268339 0.244985 0.203078 0.211678 0.203312 0.211252
qa: -0.5595 -0.5581 -0.2634 -0.5034 -0.5953 -0.6651 -0.5960 -0.5448 -0.2432 0.0673 0.5400 -0.6182 -0.2703 -0.0059 0.8849 0.3773 0.1779 -0.1939 -0.1488 0.1836 -0.1628 0.1676 0.3224 -0.2229 -0.3675 0.2466 0.3233 0.3218 0.3265 0.3313 0.3237 0.3301 0.3195 0.3218 0.1705 0.1912 0.2025 0.1923 0.1969
va: 1.6565 1.6596 0.9004 2.9588 3.1280 1.7226 1.7051 3.4303 4.1555 3.7555 3.4955 5.6192 4.2743 3.8258 0.9884 4.1157 4.2469 3.2585 3.1819 4.0212 3.2078 4.0698 4.0625 3.2726 3.8512 4.0816 0.9042 0.9039 0.9091 0.9287 0.9222 0.9072 0.9068 0.9040 0.9461 0.9547 0.9341 0.9535 0.9299
energy: -1953.736137253144
dipole: -0.77327 0.37040 -0.40288 -3.00257 2.20667 -0.79590 0.88230 -0.97532 -0.09302
magnitude: 0.89689 au
magnitude: 2.27972 debye
