program: Orca
programVersion: 5.0.4
elementType: S S F N N O O C C C C C C C C C C N N C N C C N C C H H H H H H H H H
keywords: PBE0 aug-cc-pVDZ AutoAux D4 VeryTightSCF
charge: -4
multiplicity: 1
formula: C15H9FN6O2S2
InChI: InChI=1/C15H9FN6O2S2/c16-6-3-1-5(2-4-6)7(8-10(17)19-14(25)21-12(8)23)9-11(18)20-15(26)22-13(9)24/h1-4,7H,17-18H2
35 atoms
S  3.842707 -1.485988 -4.050464
S  -5.796056 0.026177 -1.047564
F  1.76211 0.458211 5.370757
N  0.148594 -3.506626 -1.477428
N  -1.117318 1.353161 -0.217343
O  1.630274 0.879924 -0.353675
O  -2.310252 -3.238993 0.1290
C  -0.163589 -1.383699 0.397427
C  2.145012 -0.661951 3.336619
C  1.659639 -1.082158 2.109437
C  1.295015 0.031587 4.174962
C  0.348385 -0.821458 1.71208
C  -0.010309 0.30191 3.832136
C  -0.474413 -0.134104 2.596106
C  -1.576854 -0.993829 0.028643
C  -2.576978 -1.99533 -0.070781
C  -1.983492 0.304177 -0.274554
N  -3.853296 -1.662351 -0.39468
N  -3.249255 0.61929 -0.608151
C  -4.14487 -0.380078 -0.643635
N  1.820354 -2.449569 -2.632492
C  2.642157 -1.397504 -2.783351
C  0.93697 -2.394252 -1.622102
N  2.591979 -0.293197 -2.031226
C  0.832844 -1.315241 -0.745356
C  1.682645 -0.214893 -1.023971
H  0.143501 -4.120569 -2.275769
H  -0.729655 -3.428283 -0.967633
H  -0.107605 1.175154 -0.218437
H  -1.437016 2.196634 -0.664561
H  -0.252124 -2.451625 0.623876
H  3.165288 -0.863596 3.641575
H  2.319776 -1.619949 1.437302
H  -0.652224 0.844086 4.516629
H  -1.501606 0.069433 2.317494
elementType: S F N O C H
totalener: -1951.45755506 hartree
nucrepener: 2550.73347895 hartree
electener: -4502.19103400 hartree
oneelecener: -7845.97716914 hartree
twoeener: 3343.78613513 hartree
cpcmener: -0.90175526 hartree
kineticenergy: 1944.02052198 hartree
exchangeener: -148.298650308831 hartree
correlationener: -7.070572453053 hartree
xcener: -155.369222761884 hartree
chargesum: -4.0000000
charge: -0.649663 -0.652506 -0.656555 -0.220383 -0.138056 -1.223618 -1.153605 0.988502 -0.453002 1.151564 0.152370 1.695810 -0.460515 1.377216 0.185189 0.845271 0.237124 -0.827104 -0.759153 -0.030822 -0.726821 0.023896 0.143774 -0.850088 1.096549 1.008500 -0.028263 -0.133900 -0.069603 -0.071219 -0.481122 -0.673224 -0.996361 -0.678746 -0.971433
charge: 0.059186 0.058666 0.096526 0.289369 0.294068 -0.070032 -0.099067 -0.118452 0.036114 0.039224 -0.263841 -0.149955 0.037976 0.041860 -0.107996 -0.517955 -0.358101 -0.065826 -0.033985 -0.934941 -0.035195 -0.933461 -0.347848 -0.061279 -0.097690 -0.511905 -0.022201 -0.131260 -0.149734 -0.021794 0.009324 0.020807 0.021954 0.020671 0.006771
qa: -0.6497 -0.6525 -0.6566 -0.2204 -0.1381 -1.2236 -1.1536 0.9885 -0.4530 1.1516 0.1524 1.6958 -0.4605 1.3772 0.1852 0.8453 0.2371 -0.8271 -0.7592 -0.0308 -0.7268 0.0239 0.1438 -0.8501 1.0965 1.0085 -0.0283 -0.1339 -0.0696 -0.0712 -0.4811 -0.6732 -0.9964 -0.6787 -0.9714
va: 1.3602 1.3538 0.2419 2.9692 2.9533 1.2229 1.0988 1.4703 3.5713 -3.5532 3.2322 3.5023 3.2644 -2.7102 3.7039 -0.5352 1.0097 2.0127 1.9420 3.1325 2.0962 3.0875 -0.4318 1.8160 1.7311 0.1066 0.8630 1.0859 0.9443 0.8846 0.6178 0.4240 -0.2338 0.4412 -0.3896
energy: 30325.0 31975.9 32953.7 33320.0 33522.4 33979.0 34062.8 34421.9 34536.3 34728.9 34845.1 35173.5 35846.5 36050.3 36655.1 36727.8 36937.8 37293.6 37445.7 37644.3 37827.8 37934.7 38026.4 38158.1 38721.5 39014.2 39108.2 39188.7 39454.4 39529.6 39623.2 39691.6 39692.8 39828.4 39895.8 39963.4 40403.4 40667.1 40808.5 40875.7 40946.1 41007.8 41132.9 41260.6 41401.3 41618.1 41687.4 41907.5 41971.6 42009.8 42243.6 42275.5 42310.6 42492.0 42532.7 42668.4 42739.7 42741.5 42928.1 43270.5 43400.6 43436.1 43514.1 43608.0 43698.8 43788.2 43836.4 43883.6 44023.9 44152.2 44281.7 44390.3 44442.3 44505.3 44586.8 44627.5 44699.5 44745.5 44797.1 44920.2 44963.2 45020.2 45221.0 45261.5 45295.2 45465.5 45511.3 45573.4 45702.6 45835.7 45909.4 45944.4 46111.6 46152.5 46245.5 46419.2 46433.2 46493.0 46661.0 46722.1 46799.5 46842.9 47024.0 47097.0 47138.6 47165.6 47223.1 47274.4 47343.5 47431.9 47456.6 47581.3 47644.7 47656.4 47722.4 47814.6 47829.8 47939.1 48080.7 48094.9 48123.7 48230.7 48274.8 48294.0 48364.8 48432.0 48475.4 48503.7 48601.5 48627.0 48704.3 48782.0 48827.2 48978.9 49013.3 49035.5 49175.9 49220.6 49342.8 49407.0 49548.0 49692.4 49714.7 49836.9 49873.4 49923.3 50005.0 50065.9 50112.7 50237.4 50257.0 50343.6 50396.6 50442.1 50494.3 50547.2 50616.6 50636.3 50705.9 50793.6 50862.6 50894.9 51004.9 51049.3 51169.5 51196.0 51303.4 51335.8 51412.9 51480.2 51511.9 51587.1 51644.7 51702.7 51731.2 51818.2 51856.9 51902.8 51972.2 52026.2 52061.6 52079.7 52116.2 52171.7 52241.0 52257.3 52327.3 52445.8 52471.6 52603.9 52665.2 52770.3 52807.1 52830.5 52897.0 52948.3 52964.9 53020.5 53061.8 53140.0
energy: -1951.379195732796
dipole: 0.89020 2.43607 3.32626 -2.07870 2.61086 0.53216 3.54541 5.84557 9.39098
magnitude: 9.97686 au
magnitude: 25.35915 debye
