program: Orca
programVersion: 5.0.4
elementType: S S F N N O O C C C C C C C C C C N N C N C C N C C H H H H H H H H H
keywords: PBE0 ma-def2-TZVP AutoAux D4 VeryTightSCF TightOPT
charge: -4
multiplicity: 1
formula: C15H9FN6O2S2
InChI: InChI=1/C15H9FN6O2S2/c16-6-3-1-5(2-4-6)7(8-10(17)19-14(25)21-12(8)23)9-11(18)20-15(26)22-13(9)24/h1-4,7H,17-18H2
35 atoms
S  3.860925 -1.515685 -4.037796
S  -5.806034 0.051482 -1.047195
F  1.772431 0.454875 5.363869
N  0.173946 -3.535563 -1.450933
N  -1.131182 1.373106 -0.17253
O  1.607284 0.883529 -0.386342
O  -2.314907 -3.229589 0.06964
C  -0.171822 -1.379485 0.391215
C  2.153253 -0.645444 3.317307
C  1.663439 -1.063271 2.090718
C  1.301433 0.030528 4.167708
C  0.345817 -0.81751 1.704757
C  -0.010022 0.286008 3.836685
C  -0.478125 -0.14697 2.601145
C  -1.583564 -0.981911 0.022011
C  -2.581986 -1.98459 -0.103577
C  -1.993074 0.321285 -0.258028
N  -3.857125 -1.645635 -0.424951
N  -3.258495 0.639062 -0.588819
C  -4.151861 -0.360334 -0.647589
N  1.842129 -2.47812 -2.609658
C  2.651174 -1.419428 -2.775784
C  0.950084 -2.41608 -1.60756
N  2.583224 -0.303876 -2.043662
C  0.827309 -1.322474 -0.750117
C  1.669359 -0.217483 -1.041329
H  0.191931 -4.166268 -2.236753
H  -0.719005 -3.457973 -0.964392
H  -0.120238 1.198906 -0.2011
H  -1.456922 2.224141 -0.602585
H  -0.269187 -2.446429 0.621299
H  3.179249 -0.836095 3.61142
H  2.32592 -1.588267 1.410545
H  -0.654618 0.814861 4.52968
H  -1.510401 0.045194 2.333572
totalener: -1951.62990843 hartree
nucrepener: 2559.60997276 hartree
electener: -4511.23988118 hartree
oneelecener: -7865.21984807 hartree
twoeener: 3353.97996689 hartree
cpcmener: -0.89963324 hartree
kineticenergy: 1946.33494074 hartree
exchangeener: -148.494054729463 hartree
correlationener: -7.069394226968 hartree
xcener: -155.563448956431 hartree
elementType: S F N O C H
chargesum: -4.0000000
charge: -0.931104 -0.934753 -0.272289 -0.672631 -0.581354 -0.824401 -0.884412 -0.579751 -0.327802 0.169295 0.572083 -0.891915 -0.329722 0.271373 0.133271 0.279019 0.021175 -0.707998 -0.682778 0.415186 -0.682902 0.462687 -0.045085 -0.653558 1.333711 0.288310 0.288108 0.297733 0.302730 0.283892 0.125693 0.185731 0.189614 0.184520 0.198326
charge: -0.204130 -0.204683 0.058120 -0.106918 -0.093903 -0.257573 -0.289601 -0.180288 -0.133915 -0.121836 -0.266034 -0.158699 -0.133288 -0.131038 -0.177788 -0.459928 -0.357610 -0.083617 -0.077504 -0.688006 -0.077357 -0.687604 -0.348396 -0.077523 -0.172350 -0.459478 0.209356 0.207239 0.212052 0.209803 0.235340 0.200191 0.207529 0.200054 0.209382
qa: -0.9311 -0.9348 -0.2723 -0.6726 -0.5814 -0.8244 -0.8844 -0.5798 -0.3278 0.1693 0.5721 -0.8919 -0.3297 0.2714 0.1333 0.2790 0.0212 -0.7080 -0.6828 0.4152 -0.6829 0.4627 -0.0451 -0.6536 1.3337 0.2883 0.2881 0.2977 0.3027 0.2839 0.1257 0.1857 0.1896 0.1845 0.1983
va: 1.1082 1.1066 0.8797 2.9636 2.7865 1.4517 1.4392 3.4441 4.3208 3.2827 3.4087 5.3392 4.2041 3.4069 2.5187 3.9321 4.3833 2.6857 2.6070 3.6292 2.6140 3.5049 4.2409 2.6902 -0.4174 4.0563 0.9344 0.9325 0.9424 0.9366 0.9771 0.9556 0.9307 0.9570 0.9335
energy: -1951.777834487754
dipole: 0.89832 2.41358 3.31190 -2.08897 2.60403 0.51506 3.65569 5.74652 9.40221
magnitude: 9.98176 au
magnitude: 25.37161 debye
