program: Orca
programVersion: 5.0.4
elementType: S S F N N O O C C C C C C C C C C N N C N C C N C C H H H H H H H H H H H H H H H
keywords: PBE0 aug-cc-pVDZ AutoAux D4 VeryTightSCF
charge: 2
multiplicity: 1
formula: C15H15FN6O2S2
InChI: InChI=1/C15H15FN6O2S2/c16-6-3-1-5(2-4-6)7(8-10(17)19-14(25)21-12(8)23)9-11(18)20-15(26)22-13(9)24/h1-4,7,19-22H,17-18H3
41 atoms
S  3.608389 -1.756514 -4.175596
S  -5.597309 0.489763 -1.350035
F  1.777286 0.618789 5.262963
N  0.341526 -3.876616 -1.050793
N  -1.047961 1.470822 0.4376
O  1.174911 0.829295 -0.825399
O  -2.208298 -2.997113 -0.826718
C  -0.212235 -1.434867 0.426339
C  2.199306 -0.133187 3.084229
C  1.707772 -0.621612 1.883447
C  1.308189 0.134512 4.100592
C  0.347083 -0.834052 1.70335
C  -0.047858 -0.083461 3.968311
C  -0.519885 -0.577724 2.76353
C  -1.528101 -0.866894 -0.044132
C  -2.458131 -1.806866 -0.630204
C  -1.921144 0.422106 -0.013063
N  -3.684549 -1.310615 -0.98682
N  -3.145862 0.829461 -0.419414
C  -4.095045 -0.01819 -0.901055
N  1.856081 -2.724549 -2.446973
C  2.545687 -1.649795 -2.921732
C  1.008018 -2.648003 -1.399005
N  2.26419 -0.489068 -2.27363
C  0.751152 -1.50602 -0.727821
C  1.378949 -0.312525 -1.241603
H  0.46601 -4.606748 -1.758225
H  -0.695653 -3.669023 -0.941296
H  -0.075584 1.28172 0.029892
H  -1.357838 2.39465 0.119907
H  -0.4615 -2.460043 0.709909
H  3.258964 0.038146 3.228665
H  2.414366 -0.844246 1.09346
H  -0.718314 0.123145 4.79335
H  -1.583525 -0.763644 2.655456
H  2.721638 0.348404 -2.61896
H  2.008453 -3.611021 -2.917587
H  -3.398233 1.811078 -0.35993
H  -4.345016 -1.977011 -1.372423
H  -0.98076 1.494356 1.463041
H  0.696193 -4.24604 -0.159526
elementType: S F N O C H
totalener: -1954.22253392 hartree
nucrepener: 2726.12666933 hartree
electener: -4680.34920325 hartree
oneelecener: -8046.30939328 hartree
twoeener: 3365.96019003 hartree
cpcmener: -0.39241213 hartree
kineticenergy: 1946.76852739 hartree
exchangeener: -148.876812668970 hartree
correlationener: -7.089639783167 hartree
xcener: -155.966452452137 hartree
chargesum: 2.0000000
charge: -0.222799 -0.229131 -0.638291 -0.642500 -0.659892 -1.042122 -1.005338 1.314836 -0.351215 1.034723 0.320221 2.046144 -0.248853 0.744060 1.352746 0.782265 0.561523 -0.563327 -0.376656 0.444665 -0.493520 0.386286 1.412232 -0.396240 0.195922 0.124650 0.292608 0.262452 0.267196 0.294450 -0.489344 -0.660752 -0.955388 -0.658599 -1.007039 0.032442 0.015877 -0.012469 0.057791 0.378935 0.331451
charge: 0.562092 0.556109 0.117438 0.539396 0.531866 0.167356 0.154077 -0.060246 0.066633 0.065860 -0.240446 -0.141183 0.066824 0.056661 -0.000672 -0.256379 -0.067845 0.183346 0.185066 -0.692563 0.187598 -0.691202 -0.057635 0.186218 -0.006973 -0.262981 0.118615 -0.036440 -0.053799 0.119015 0.064201 0.030960 0.027320 0.031683 0.042367 0.065139 0.075477 0.074074 0.064419 0.096852 0.131700
qa: -0.2228 -0.2291 -0.6383 -0.6425 -0.6599 -1.0421 -1.0053 1.3148 -0.3512 1.0347 0.3202 2.0461 -0.2489 0.7441 1.3527 0.7823 0.5615 -0.5633 -0.3767 0.4447 -0.4935 0.3863 1.4122 -0.3962 0.1959 0.1247 0.2926 0.2625 0.2672 0.2945 -0.4893 -0.6608 -0.9554 -0.6586 -1.0070 0.0324 0.0159 -0.0125 0.0578 0.3789 0.3315
va: 1.7847 1.7771 0.2605 2.8020 2.9568 1.3081 1.3268 1.1434 3.2598 -1.7799 2.9708 3.6046 3.3759 -2.4698 0.8488 -1.2546 -2.7818 2.7829 2.4647 3.1403 2.7960 3.2527 -7.6164 2.7833 2.7755 1.9463 0.7151 0.9523 0.8982 0.7154 0.5511 0.4459 -0.3796 0.4442 -0.2458 0.8635 0.8521 0.8645 0.8461 0.7302 0.8077
energy: 30017.1 30154.9 32399.4 33375.6 33799.5 34092.6 34159.5 35295.8 35970.8 36526.9 36922.9 37199.9 38528.2 38661.7 39499.9 40177.0 40712.0 40761.8 40864.3 41345.3 41857.8 42646.9 43177.0 44329.6 44546.3 44965.6 45294.5 45421.9 45485.1 45695.4 46708.0 46938.4 47209.6 47427.4 47534.7 47801.5 47818.9 47852.3 47897.3 48214.1 49143.5 49328.4 49338.6 49511.6 49830.2 50056.6 50395.7 50576.1 50857.8 51545.4 51763.0 52006.7 52140.1 52283.0 52475.3 52586.8 52662.8 52774.3 53076.2 53487.7 53580.1 53676.8 54035.4 54097.5 54111.9 54232.9 54297.2 54419.6 54652.0 54785.2 54858.9 55065.0 55156.4 55606.2 55759.0 56071.2 56177.0 56331.3 56506.9 56585.8 56667.8 56797.6 57044.6 57078.7 57136.9 57202.6 57290.2 57349.1 57563.5 57624.2 57799.0 57840.2 57965.9 58001.4 58225.5 58303.0 58334.5 58479.4 58582.9 58662.6 58680.0 58987.5 59079.3 59228.9 59397.9 59469.0 59543.8 59613.1 59647.2 59694.5 59889.6 59948.8 60056.5 60168.6 60359.9 60510.7 60706.8 60840.8 60864.7 60906.4 60932.8 61067.6 61098.9 61163.6 61269.2 61292.6 61331.3 61561.3 61599.3 61666.5 61698.0 61724.4 61828.2 61840.4 61967.4 62133.9 62258.7 62295.5 62365.3 62402.0 62480.8 62538.0 62549.4 62604.9 62668.5 62732.8 62778.4 62848.8 63041.7 63112.8 63250.6 63422.6 63543.8 63579.0 63644.6 63717.5 63797.6 63813.7 63947.5 63977.7 64041.0 64074.3 64163.4 64303.6 64442.2 64526.0 64529.5 64731.3 64753.1 64900.5 65023.9 65053.4 65069.8 65119.9 65199.7 65336.8 65344.1 65539.2 65573.7 65604.2 65665.6 65698.1 65737.8 65820.0 65889.1 65942.6 65978.3 66059.9 66098.7 66181.2 66214.8 66277.8 66298.9 66359.5 66453.7 66570.8 66613.4 66683.8 66738.3 66752.6
energy: -1954.143595645899
dipole: -0.51708 0.29814 -0.21894 -4.13971 1.77212 -2.36759 1.38595 -1.22981 0.15614
magnitude: 2.38281 au
magnitude: 6.05663 debye
