program: Orca
programVersion: 5.0.4
elementType: S S F N N O O C C C C C C C C C C N N C N C C N C C H H H H H H H H H H H H H
keywords: PBE0 aug-cc-pVDZ AutoAux D4 VeryTightSCF
charge: 0
multiplicity: 1
formula: C15H13FN6O2S2
InChI: InChI=1/C15H13FN6O2S2/c16-6-3-1-5(2-4-6)7(8-10(17)19-14(25)21-12(8)23)9-11(18)20-15(26)22-13(9)24/h1-4,7,19-22H,17-18H2
39 atoms
S  4.209378 -4.080927 -2.118091
S  -5.770593 -1.508256 -1.323076
F  1.204485 4.096157 2.572299
N  1.144673 -0.235273 -1.875853
N  -1.968047 -3.191629 1.318443
O  0.882666 -3.613104 1.448731
O  -1.405206 0.698514 -1.357334
C  -0.135269 -1.048546 0.697787
C  1.89186 2.06263 1.616119
C  1.552029 0.805901 1.132405
C  0.889213 2.870012 2.105391
C  0.234793 0.363746 1.131107
C  -0.429418 2.464383 2.138003
C  -0.744473 1.207488 1.649457
C  -1.518338 -1.167962 0.10173
C  -2.022695 -0.238731 -0.840784
C  -2.338383 -2.214213 0.48927
N  -3.358648 -0.401513 -1.213236
N  -3.626711 -2.277707 0.026232
C  -4.186208 -1.381421 -0.815734
N  2.488774 -2.091549 -1.83765
C  2.975229 -3.255898 -1.356251
C  1.487305 -1.35772 -1.252699
N  2.379009 -3.68933 -0.232378
C  0.930325 -1.794133 -0.063114
C  1.349541 -3.045494 0.453856
H  2.900633 -1.753422 -2.698555
H  -4.212098 -3.050762 0.315493
H  1.539796 -0.026034 -2.77958
H  0.273964 0.241029 -1.616284
H  -0.97698 -3.356531 1.498238
H  -2.603985 -3.952698 1.504093
H  2.69217 -4.572066 0.150219
H  -3.725176 0.276289 -1.868813
H  -0.187158 -1.588582 1.648899
H  2.91915 2.407654 1.612648
H  2.340125 0.163342 0.759165
H  -1.192354 3.12222 2.537569
H  -1.778408 0.882108 1.674639
elementType: S F N O C H
totalener: -1953.39111800 hartree
nucrepener: 2658.10908490 hartree
electener: -4611.50020291 hartree
oneelecener: -7963.51991535 hartree
twoeener: 3352.01971244 hartree
cpcmener: -0.06012237 hartree
kineticenergy: 1946.15355128 hartree
exchangeener: -148.756254145241 hartree
correlationener: -7.087638516361 hartree
xcener: -155.843892661602 hartree
chargesum: 0.0000000
charge: -0.315933 -0.312964 -0.652409 -0.126485 -0.190765 -0.916243 -0.991708 1.280991 -0.438369 1.277295 0.142509 1.464348 -0.418343 1.184624 1.339226 0.315486 0.560509 -0.428130 -0.503565 0.462654 -0.342579 0.456490 -0.412113 -0.494709 1.072143 0.794025 -0.010385 0.026670 -0.053463 0.045889 -0.036316 -0.020586 0.024069 0.001048 -0.517943 -0.679038 -0.937849 -0.674984 -0.973096
charge: 0.466142 0.466899 0.104952 0.373117 0.370626 0.095338 0.113731 -0.084774 0.048941 0.052059 -0.254718 -0.136621 0.048444 0.053182 -0.046225 -0.332999 -0.178097 0.156163 0.165785 -0.715523 0.166173 -0.715414 -0.191477 0.155284 -0.051413 -0.333344 0.053839 0.054140 0.032446 -0.101234 -0.090181 0.032090 0.045420 0.044900 0.037669 0.024726 0.018276 0.024946 0.026735
qa: -0.3159 -0.3130 -0.6524 -0.1265 -0.1908 -0.9162 -0.9917 1.2810 -0.4384 1.2773 0.1425 1.4643 -0.4183 1.1846 1.3392 0.3155 0.5605 -0.4281 -0.5036 0.4627 -0.3426 0.4565 -0.4121 -0.4947 1.0721 0.7940 -0.0104 0.0267 -0.0535 0.0459 -0.0363 -0.0206 0.0241 0.0010 -0.5179 -0.6790 -0.9378 -0.6750 -0.9731
va: 1.6816 1.6863 0.2506 2.9659 3.0336 1.3079 1.4185 -0.1828 3.2378 -3.1090 3.2912 4.3790 3.3938 -4.2039 1.3129 2.0054 -2.2976 2.7127 2.7793 3.0472 2.6431 3.0532 0.7325 2.8102 2.4705 -0.6621 0.8425 0.8270 0.8552 0.8394 0.9698 0.8325 0.8570 0.8595 0.6454 0.4310 -0.3387 0.4259 -0.3094
energy: 33326.5 33363.3 33832.5 36268.2 36851.4 38651.5 38840.5 39680.1 39718.3 40434.5 40788.7 41137.8 41391.9 41424.1 41495.2 41932.2 42537.2 42631.5 42762.8 42948.6 43037.5 43162.5 43730.6 44142.0 44257.3 45104.3 45169.9 45199.2 45559.9 45666.5 45731.8 45800.6 46128.0 46161.3 46346.0 46473.5 46552.2 46908.6 47019.8 47060.4 47199.5 47456.5 47996.1 48091.5 48241.5 48322.1 48405.2 48538.7 48754.5 48887.8 48978.5 49029.3 49245.7 49349.0 49438.7 49528.9 49611.4 49734.8 49904.1 49968.7 50012.0 50056.5 50127.2 50303.2 50449.4 50516.8 50654.8 50854.6 50983.9 51119.2 51175.0 51311.3 51423.2 51537.3 51623.6 51670.2 51819.4 51989.9 52325.8 52362.7 52450.7 52578.8 52702.7 52889.3 53094.0 53148.4 53157.0 53351.5 53653.3 53665.7 53859.7 54084.1 54204.9 54329.3 54411.5 54511.1 54557.1 54608.2 54639.8 54735.1 54781.5 54812.6 54871.8 54926.8 54956.8 54995.6 55210.9 55254.6 55469.0 55526.2 55554.5 55667.7 55692.5 55847.7 55900.9 56075.9 56106.5 56176.7 56193.8 56355.7 56401.1 56478.2 56517.8 56615.3 56745.3 56904.6 57013.2 57067.7 57153.1 57264.8 57373.1 57409.9 57517.4 57604.6 57714.1 58048.8 58140.2 58209.2 58244.9 58312.9 58363.4 58447.0 58495.3 58596.5 58652.6 58696.8 58753.2 58836.6 58881.3 58942.8 58966.7 58996.1 59144.9 59218.6 59316.9 59360.6 59431.4 59485.7 59543.7 59604.7 59663.5 59723.1 59763.2 59825.9 59866.2 59889.0 59964.7 60028.5 60127.3 60164.5 60196.3 60248.2 60381.4 60480.8 60630.2 60709.5 60933.3 60941.2 60992.9 61131.1 61170.2 61296.1 61320.7 61374.7 61445.8 61523.8 61601.8 61690.8 61819.7 61847.5 61960.8 62054.1 62217.0 62281.6 62422.2 62552.0 62565.3 62743.9 62824.2 62872.3
energy: -1953.296841322877
dipole: -0.69600 0.38868 -0.30732 -2.91902 2.30019 -0.61883 0.96455 -0.85679 0.10775
magnitude: 0.69930 au
magnitude: 1.77747 debye
