program: Orca
programVersion: 5.0.4
elementType: S S F N N O O C C C C C C C C C C N N C N C C N C C H H H H H H H H H
keywords: PBE0 aug-cc-pVDZ AutoAux D4 VeryTightSCF
charge: -4
multiplicity: 1
formula: C15H9FN6O2S2
InChI: InChI=1/C15H9FN6O2S2/c16-6-3-1-5(2-4-6)7(8-10(17)19-14(25)21-12(8)23)9-11(18)20-15(26)22-13(9)24/h1-4,7H,17-18H2
35 atoms
S  3.94225 -1.700591 -3.979987
S  -5.83001 0.245496 -0.882212
F  1.735313 0.463116 5.331461
N  0.280185 -3.676939 -1.30285
N  -1.124298 1.443338 0.026576
O  1.488069 0.87237 -0.576133
O  -2.307135 -3.152809 -0.290569
C  -0.195687 -1.37074 0.346407
C  2.167898 -0.455695 3.206485
C  1.683954 -0.874209 1.975913
C  1.271914 0.037766 4.131801
C  0.328713 -0.807381 1.658526
C  -0.078431 0.113238 3.871385
C  -0.536584 -0.315179 2.631924
C  -1.590884 -0.918627 -0.032323
C  -2.583748 -1.91482 -0.291964
C  -1.993906 0.405727 -0.168119
N  -3.86994 -1.527556 -0.546692
N  -3.264372 0.761446 -0.449809
C  -4.159911 -0.226014 -0.5978
N  1.94005 -2.640345 -2.50793
C  2.701173 -1.559165 -2.741892
C  1.017149 -2.536873 -1.532606
N  2.570193 -0.393855 -2.10883
C  0.822906 -1.385162 -0.776332
C  1.620298 -0.255095 -1.134783
H  0.360714 -4.350475 -2.049868
H  -0.67392 -3.547262 -0.939176
H  -0.120819 1.25151 -0.134805
H  -1.465599 2.324654 -0.326033
H  -0.355162 -2.427854 0.590317
H  3.224461 -0.505133 3.444576
H  2.381307 -1.254653 1.238598
H  -0.758599 0.501954 4.620882
H  -1.597203 -0.259681 2.41673
elementType: S F N O C H
totalener: -1951.42988904 hartree
nucrepener: 2547.72940275 hartree
electener: -4499.15929179 hartree
oneelecener: -7839.23732029 hartree
twoeener: 3340.07802850 hartree
cpcmener: -0.85836391 hartree
kineticenergy: 1943.96138594 hartree
exchangeener: -148.276348429061 hartree
correlationener: -7.069637717182 hartree
xcener: -155.345986146244 hartree
chargesum: -4.0000000
charge: -0.670813 -0.671803 -0.662025 -0.229160 -0.215181 -1.150293 -1.089610 1.153189 -0.430105 1.174384 0.161809 1.485167 -0.443815 1.229249 0.583647 0.741965 0.298472 -0.807996 -0.774508 -0.036991 -0.754949 0.021309 0.355286 -0.850462 0.751227 0.794856 -0.019133 -0.095112 -0.056306 -0.037529 -0.462475 -0.670266 -0.980783 -0.677127 -0.964116
charge: 0.028018 0.026473 0.092878 0.273672 0.282086 0.009728 -0.012554 -0.113962 0.033333 0.042187 -0.267502 -0.140451 0.032286 0.038634 -0.105422 -0.496184 -0.369538 -0.065191 -0.045902 -0.940810 -0.046382 -0.938996 -0.360423 -0.061359 -0.102440 -0.497733 -0.034591 -0.147184 -0.150709 -0.033246 0.011523 0.018980 0.012198 0.019047 0.009538
qa: -0.6708 -0.6718 -0.6620 -0.2292 -0.2152 -1.1503 -1.0896 1.1532 -0.4301 1.1744 0.1618 1.4852 -0.4438 1.2292 0.5836 0.7420 0.2985 -0.8080 -0.7745 -0.0370 -0.7549 0.0213 0.3553 -0.8505 0.7512 0.7949 -0.0191 -0.0951 -0.0563 -0.0375 -0.4625 -0.6703 -0.9808 -0.6771 -0.9641
va: 1.3217 1.3130 0.2397 2.8821 2.9313 1.3021 1.2086 1.6163 3.4980 -3.9418 3.2558 4.4461 3.4449 -3.3042 3.4534 0.1545 0.6853 1.9366 1.8347 3.0751 2.0402 3.0438 -1.1748 1.7414 2.2632 0.9650 0.8693 1.1025 0.9911 0.8874 0.6555 0.4333 -0.2728 0.4348 -0.2745
energy: 29152.5 30435.0 31458.5 32011.6 33040.6 33102.0 33149.4 34174.4 34414.5 34492.2 34577.6 34815.3 34901.8 35014.2 35185.2 35602.8 35688.2 36186.2 36689.6 36782.5 37021.7 37201.1 37339.7 37414.8 37553.9 37683.8 37996.4 38164.9 38376.1 38433.2 38627.2 38806.4 38883.5 38943.9 38990.5 39196.6 39269.0 39322.8 39453.6 39568.4 39688.0 39883.6 40106.9 40115.6 40250.8 40295.9 40314.6 40648.4 40808.0 40900.6 41127.8 41248.6 41352.6 41387.6 41485.9 41544.6 41646.2 41848.8 41909.4 42101.5 42214.5 42225.8 42274.6 42428.9 42586.0 42632.5 42686.1 42753.2 42855.4 42919.1 43020.4 43071.7 43106.0 43154.2 43225.0 43330.0 43423.6 43463.9 43540.4 43606.1 43635.9 43688.9 43767.1 43872.5 43918.7 44084.1 44121.8 44205.6 44341.2 44397.2 44457.9 44541.1 44633.7 44672.9 44777.6 44799.5 44885.4 45040.6 45069.9 45170.1 45196.0 45291.8 45380.9 45396.5 45496.8 45569.8 45602.5 45634.6 45789.3 45838.5 45919.0 46056.6 46127.4 46153.8 46171.0 46249.0 46289.0 46391.4 46505.2 46576.3 46603.6 46736.3 46800.8 46869.9 46888.9 46914.2 46974.3 47074.1 47107.2 47226.9 47242.9 47306.5 47336.4 47371.0 47448.7 47481.7 47565.2 47601.9 47679.0 47746.6 47811.9 47870.5 47910.1 48014.9 48141.6 48208.6 48221.3 48310.1 48353.7 48385.0 48420.4 48563.8 48654.7 48734.3 48768.9 48815.9 48877.4 48975.5 49000.9 49150.2 49207.2 49228.5 49299.8 49365.8 49494.8 49522.4 49542.9 49571.1 49647.2 49720.9 49776.5 49857.5 49930.0 49952.7 50003.9 50073.9 50120.7 50239.6 50288.7 50312.9 50365.9 50433.5 50454.6 50500.6 50517.8 50577.6 50630.6 50652.3 50781.1 50851.8 50923.1 51001.2 51068.9 51073.4 51107.6 51188.6 51326.0 51395.1 51470.7 51519.1
energy: -1951.356773662716
dipole: 0.94758 2.43181 3.37939 -2.16620 2.57651 0.41031 4.03212 5.84165 9.87377
magnitude: 10.44414 au
magnitude: 26.54688 debye
