program: Orca
programVersion: 5.0.4
elementType: S S F N N O O C C C C C C C C C C N N C N C C N C C H H H H H H H H H H H H H
keywords: PBE0 aug-cc-pVDZ AutoAux D4 VeryTightSCF
charge: 0
multiplicity: 1
formula: C15H13FN6O2S2
InChI: InChI=1/C15H13FN6O2S2/c16-6-3-1-5(2-4-6)7(8-10(17)19-14(25)21-12(8)23)9-11(18)20-15(26)22-13(9)24/h1-4,7,19-22H,17-18H2
39 atoms
S  4.186357 -4.103878 -2.103659
S  -5.746127 -1.509391 -1.384452
F  1.214562 4.101388 2.571427
N  1.097797 -0.281413 -1.902216
N  -1.963448 -3.217188 1.260925
O  0.942053 -3.561417 1.525948
O  -1.414472 0.757609 -1.288976
C  -0.13873 -1.043201 0.710252
C  1.890066 2.082651 1.577249
C  1.547808 0.824562 1.097963
C  0.896719 2.875113 2.107697
C  0.236678 0.367972 1.141192
C  -0.415717 2.454341 2.184718
C  -0.733616 1.19702 1.700245
C  -1.517527 -1.157787 0.101751
C  -2.028322 -0.210468 -0.812031
C  -2.331651 -2.223607 0.454331
N  -3.351881 -0.376334 -1.210946
N  -3.612151 -2.289882 -0.027329
C  -4.173024 -1.377979 -0.852883
N  2.457746 -2.12041 -1.839431
C  2.963313 -3.269846 -1.339642
C  1.461198 -1.380937 -1.254886
N  2.392775 -3.677852 -0.191777
C  0.92635 -1.795477 -0.045472
C  1.37798 -3.020306 0.496029
H  2.852919 -1.7994 -2.714733
H  -4.193698 -3.074953 0.236789
H  1.489522 -0.07677 -2.808324
H  0.258161 0.230154 -1.618256
H  -0.982295 -3.358009 1.493316
H  -2.597109 -3.982436 1.436381
H  2.719862 -4.546496 0.212117
H  -3.715536 0.318797 -1.850531
H  -0.20035 -1.579487 1.662771
H  2.912686 2.439474 1.53893
H  2.329973 0.194072 0.692401
H  -1.171421 3.100813 2.61554
H  -1.76248 0.858929 1.759933
elementType: S F N O C H
totalener: -1953.39201847 hartree
nucrepener: 2658.58418962 hartree
electener: -4611.97620809 hartree
oneelecener: -7964.59697109 hartree
twoeener: 3352.62076300 hartree
cpcmener: -0.07049816 hartree
kineticenergy: 1946.14496747 hartree
exchangeener: -148.760161651462 hartree
correlationener: -7.087280158302 hartree
xcener: -155.847441809764 hartree
chargesum: 0.0000000
charge: -0.309388 -0.305802 -0.651233 -0.127258 -0.213207 -0.955712 -1.033220 1.244892 -0.432719 1.288591 0.145729 1.534865 -0.392404 1.171921 1.356105 0.374552 0.574196 -0.442398 -0.513800 0.467797 -0.339442 0.454595 -0.403830 -0.504580 0.939286 0.857730 -0.008449 0.029275 -0.062969 0.055264 -0.020010 -0.024757 0.025915 0.006126 -0.521403 -0.679066 -0.937560 -0.675718 -0.971917
charge: 0.475659 0.476381 0.105927 0.377571 0.375919 0.060360 0.081437 -0.084012 0.050319 0.052950 -0.253513 -0.140081 0.049079 0.050278 -0.044306 -0.337755 -0.173408 0.156994 0.167961 -0.714687 0.168185 -0.714623 -0.187412 0.156013 -0.051294 -0.339112 0.054699 0.055170 0.035346 -0.096644 -0.078131 0.035094 0.047501 0.047193 0.037762 0.025135 0.018062 0.025407 0.028574
qa: -0.3094 -0.3058 -0.6512 -0.1273 -0.2132 -0.9557 -1.0332 1.2449 -0.4327 1.2886 0.1457 1.5349 -0.3924 1.1719 1.3561 0.3746 0.5742 -0.4424 -0.5138 0.4678 -0.3394 0.4546 -0.4038 -0.5046 0.9393 0.8577 -0.0084 0.0293 -0.0630 0.0553 -0.0200 -0.0248 0.0259 0.0061 -0.5214 -0.6791 -0.9376 -0.6757 -0.9719
va: 1.6906 1.6969 0.2514 2.9820 3.0391 1.2419 1.3688 -0.0924 3.1820 -2.9534 3.2751 4.1940 3.4106 -4.0145 1.1980 1.8769 -2.4301 2.7651 2.7865 3.0425 2.6568 3.0663 0.7705 2.8644 2.7206 -0.8556 0.8413 0.8251 0.8530 0.8139 0.9397 0.8304 0.8579 0.8580 0.6286 0.4324 -0.3660 0.4231 -0.2861
energy: 33186.6 33216.5 34329.3 36455.2 37195.8 38555.5 38973.0 39586.9 39961.6 40349.6 40787.9 41060.4 41371.5 41445.5 41523.2 42113.2 42446.4 42518.2 42694.3 42983.4 43325.6 43542.6 43575.7 44289.2 44465.1 44770.8 44986.3 45445.3 45514.5 45687.9 45771.2 46032.0 46356.5 46499.3 46544.4 46785.6 46865.2 46962.4 47049.8 47153.6 47682.7 47905.8 48011.6 48137.3 48219.2 48644.1 48695.5 48968.5 49051.6 49135.0 49183.1 49386.3 49476.1 49719.9 49891.0 50030.6 50040.8 50129.7 50350.9 50411.7 50496.3 50626.0 50680.8 50738.9 50917.3 50954.0 51053.1 51090.6 51402.9 51447.1 51488.5 51543.1 51808.8 51928.7 51988.8 52033.3 52092.5 52402.5 52701.9 52788.0 52900.3 53110.3 53331.9 53543.1 53651.3 53695.1 53812.6 54122.5 54220.0 54277.3 54382.9 54521.3 54685.1 54746.4 54827.0 54964.8 55037.0 55132.5 55177.5 55197.8 55287.0 55318.5 55380.8 55445.8 55500.7 55551.2 55639.6 55814.7 55876.9 55911.4 55976.4 56095.2 56104.9 56308.7 56338.3 56450.4 56514.9 56582.2 56600.6 56756.0 56804.6 56929.1 57043.7 57132.1 57277.0 57281.0 57352.6 57422.0 57544.1 57828.5 57977.9 58151.4 58207.1 58295.8 58354.4 58474.6 58654.1 58721.1 58810.1 58882.7 58933.9 58961.1 59053.0 59078.4 59169.6 59268.5 59347.1 59374.7 59425.4 59447.2 59608.8 59615.3 59738.8 59785.3 59917.3 59939.1 60019.7 60069.8 60099.4 60145.2 60182.9 60230.9 60275.8 60341.3 60445.3 60463.1 60495.6 60590.1 60629.9 60647.2 60750.3 60931.0 60947.4 61061.6 61098.6 61210.4 61329.1 61350.5 61386.7 61556.2 61609.2 61766.3 61887.1 61961.0 62010.5 62074.4 62174.3 62304.3 62363.0 62505.1 62600.7 62737.0 62826.9 62869.0 62923.5 63074.5 63287.4 63317.6 63394.8 63486.4
energy: -1953.298385969829
dipole: -0.77327 0.38100 -0.39228 -3.00257 2.23097 -0.77160 0.88230 -0.93836 -0.05606
magnitude: 0.86741 au
magnitude: 2.20477 debye
