program: Orca
programVersion: 5.0.4
elementType: S S F N N O O C C C C C C C C C C N N C N C C N C C H H H H H H H H H
keywords: PBE0 aug-cc-pVDZ AutoAux D4 VeryTightSCF
charge: -4
multiplicity: 1
formula: C15H9FN6O2S2
InChI: InChI=1/C15H9FN6O2S2/c16-6-3-1-5(2-4-6)7(8-10(17)19-14(25)21-12(8)23)9-11(18)20-15(26)22-13(9)24/h1-4,7H,17-18H2
35 atoms
S  4.185762 -1.822142 -3.814361
S  -5.930617 0.259454 -0.611293
F  1.69776 0.396295 5.346096
N  0.285591 -3.668266 -1.354385
N  -1.148556 1.452013 0.011805
O  1.549204 0.861951 -0.578214
O  -2.343498 -3.150599 -0.232726
C  -0.202271 -1.346578 0.280645
C  2.144171 -0.442606 3.166718
C  1.675392 -0.826008 1.91654
C  1.238668 0.001079 4.106247
C  0.316758 -0.787378 1.596487
C  -0.108559 0.075987 3.833703
C  -0.556422 -0.31495 2.57575
C  -1.620059 -0.910243 -0.050152
C  -2.634169 -1.912103 -0.234821
C  -2.039985 0.408915 -0.154005
N  -3.933919 -1.521481 -0.402427
N  -3.319363 0.772255 -0.356634
C  -4.220749 -0.222032 -0.440809
N  2.024808 -2.668419 -2.486651
C  2.838639 -1.611552 -2.664463
C  1.062896 -2.532548 -1.559927
N  2.709909 -0.439695 -2.048425
C  0.852043 -1.376571 -0.81734
C  1.699052 -0.265744 -1.142199
H  0.359248 -4.275699 -2.155797
H  -0.676878 -3.511769 -1.025268
H  -0.158469 1.260448 -0.21195
H  -1.524093 2.303596 -0.374502
H  -0.359617 -2.404774 0.538421
H  3.204206 -0.463117 3.400933
H  2.370584 -1.154078 1.152368
H  -0.797201 0.450794 4.584901
H  -1.609925 -0.249934 2.326608
totalener: -1950.60326123 hartree
nucrepener: 2537.64514050 hartree
electener: -4488.24840173 hartree
oneelecener: -7813.90160380 hartree
twoeener: 3325.65320207 hartree
kineticenergy: 1943.48799997 hartree
exchangeener: -148.164632541009 hartree
correlationener: -7.049372756851 hartree
xcener: -155.214005297860 hartree
chargesum: -4.0000000
charge: -0.881662 -0.880156 -0.717485 -0.158342 -0.127735 -1.102320 -1.062452 1.247283 -0.502863 1.279731 0.012238 1.437333 -0.507459 1.340763 0.747498 0.511435 0.002642 -0.593814 -0.606407 0.066140 -0.615668 0.129516 0.052928 -0.625664 1.006771 0.534355 -0.095078 -0.083065 -0.062426 -0.107364 -0.422306 -0.686152 -0.918298 -0.695249 -0.916667
charge: -0.065106 -0.068369 0.039476 0.259602 0.273887 0.003541 -0.025527 -0.104020 0.000380 0.060238 -0.284632 -0.113138 -0.001183 0.061736 -0.098170 -0.475208 -0.360603 -0.016572 -0.012314 -0.866851 -0.013988 -0.866317 -0.345227 -0.012122 -0.091207 -0.485197 -0.069957 -0.134125 -0.134023 -0.065230 0.012856 -0.010706 0.009114 -0.011103 0.010063
qa: -0.8817 -0.8802 -0.7175 -0.1583 -0.1277 -1.1023 -1.0625 1.2473 -0.5029 1.2797 0.0122 1.4373 -0.5075 1.3408 0.7475 0.5114 0.0026 -0.5938 -0.6064 0.0661 -0.6157 0.1295 0.0529 -0.6257 1.0068 0.5344 -0.0951 -0.0831 -0.0624 -0.1074 -0.4223 -0.6862 -0.9183 -0.6952 -0.9167
va: 0.7945 0.7864 0.1409 2.6881 2.7626 1.3373 1.2147 1.4025 3.3346 -4.2396 3.2483 4.1159 3.2068 -3.8040 2.8488 0.9951 1.3011 1.9721 2.0894 2.8885 2.1536 2.8515 -0.5969 1.9597 1.5358 1.8497 0.9975 1.0764 0.9935 1.0032 0.7783 0.4462 -0.1352 0.4475 -0.1636
energy: 2555.8 4886.6 4988.1 5307.2 5697.7 7906.0 8028.6 8280.7 9413.3 10156.7 12327.1 12954.2 13142.4 13345.2 13836.2 14044.5 14215.1 15068.3 15247.5 15459.8 15585.4 15654.8 15873.5 15992.1 16198.6 16708.1 16745.2 16793.1 16852.0 16938.0 17054.8 17236.1 17326.5 17418.4 17476.8 17702.5 17726.0 18042.6 18319.0 18442.3 18878.6 19184.9 19612.7 20068.7 20131.1 20200.4 20435.7 20702.1 20858.7 20963.4 21105.0 21240.4 21247.2 21555.4 21680.0 21717.5 21911.3 21989.7 22199.2 22416.9 22757.0 22973.3 23244.0 23350.7 23445.6 23758.2 23768.8 24060.1 24130.5 24205.9 24379.5 24617.3 24629.0 24644.7 24818.1 24834.7 24874.1 24926.0 25037.5 25164.6 25284.6 25297.4 25466.2 25563.5 25579.2 25793.8 25870.8 25928.9 25955.8 26005.2 26136.6 26186.1 26290.2 26423.4 26452.3 26476.2 26516.9 26584.2 26662.8 26689.7 26779.1 26840.4 26893.3 26934.0 27143.1 27201.0 27558.2 27620.7 27638.1 27748.6 27910.6 27988.1 28111.5 28174.5 28195.7 28231.1 28255.7 28294.8 28326.7 28376.3 28441.0 28464.7 28583.4 28651.8 28726.6 28758.1 28777.8 28895.2 28909.7 28978.8 29023.0 29063.3 29095.0 29269.7 29575.3 29602.2 29650.9 29719.5 29758.4 29820.5 29996.9 30013.7 30093.2 30292.3 30318.8 30365.7 30379.9 30417.1 30583.0 30707.2 30733.3 30775.7 30802.1 30937.4 31004.3 31034.1 31114.8 31180.5 31248.9 31306.5 31363.7 31460.2 31471.4 31612.7 31773.2 31863.0 31943.7 31991.1 31996.3 32037.8 32063.3 32134.6 32198.5 32396.4 32426.6 32485.4 32531.1 32616.7 32742.7 32792.4 32829.4 32959.6 33050.5 33149.9 33228.1 33283.6 33380.3 33467.5 33543.9 33641.4 33667.8 33717.1 33785.0 33826.3 33865.4 33884.8 33993.0 34141.8 34160.5 34228.0
energy: -1950.651086702007
dipole: 0.70775 1.83612 2.54387 -1.79248 2.20699 0.41451 3.10245 4.31632 7.41877
magnitude: 7.85374 au
magnitude: 19.96263 debye
