program: Orca
programVersion: 5.0.4
elementType: S S F N N O O C C C C C C C C C C N N C N C C N C C H H H H H H H H H H H H H H H
keywords: PBE0 aug-cc-pVDZ AutoAux D4 VeryTightSCF
charge: 2
multiplicity: 1
formula: C15H15FN6O2S2
InChI: InChI=1/C15H15FN6O2S2/c16-6-3-1-5(2-4-6)7(8-10(17)19-14(25)21-12(8)23)9-11(18)20-15(26)22-13(9)24/h1-4,7,19-22H,17-18H3
41 atoms
S  3.622306 -1.77274 -4.155686
S  -5.583842 0.500377 -1.394431
F  1.773771 0.613537 5.270532
N  0.341538 -3.878601 -1.02907
N  -1.046415 1.471633 0.442245
O  1.145728 0.83244 -0.851423
O  -2.197111 -2.987655 -0.84963
C  -0.216558 -1.43089 0.429919
C  2.19434 -0.116929 3.08442
C  1.703251 -0.603478 1.882497
C  1.305254 0.132287 4.107169
C  0.344351 -0.831081 1.707269
C  -0.048623 -0.103333 3.980253
C  -0.520273 -0.59451 2.774369
C  -1.529638 -0.860816 -0.04553
C  -2.451776 -1.800081 -0.64834
C  -1.923192 0.428976 -0.015488
N  -3.672662 -1.301091 -1.017512
N  -3.142247 0.83643 -0.433433
C  -4.085899 -0.008956 -0.930264
N  1.864463 -2.733964 -2.426519
C  2.54816 -1.659637 -2.911271
C  1.01237 -2.653684 -1.383719
N  2.248897 -0.493141 -2.280626
C  0.746189 -1.506397 -0.723753
C  1.362697 -0.311426 -1.251384
H  0.452138 -4.609102 -1.739843
H  -0.693642 -3.665463 -0.914182
H  -0.075122 1.276369 0.034551
H  -1.34886 2.400215 0.128556
H  -0.466773 -2.455695 0.713521
H  3.2529 0.065632 3.224897
H  2.410837 -0.815001 1.090186
H  -0.7177 0.085923 4.810905
H  -1.581119 -0.799042 2.673199
H  2.6992 0.342566 -2.638922
H  2.030413 -3.62608 -2.88255
H  -3.396479 1.817753 -0.369962
H  -4.329307 -1.959849 -1.42282
H  -0.9802 1.496442 1.468184
H  0.699994 -4.261135 -0.144213
elementType: S F N O C H
totalener: -1954.23165245 hartree
nucrepener: 2726.36689111 hartree
electener: -4680.59854356 hartree
oneelecener: -8047.16897829 hartree
twoeener: 3366.57043473 hartree
cpcmener: -0.37760499 hartree
kineticenergy: 1946.77628354 hartree
exchangeener: -148.876963181835 hartree
correlationener: -7.090451426046 hartree
xcener: -155.967414607881 hartree
chargesum: 2.0000000
charge: -0.213572 -0.219238 -0.636497 -0.634974 -0.652589 -1.001901 -0.965446 1.377410 -0.350906 1.078131 0.330777 2.004502 -0.257913 0.754676 1.325945 0.715000 0.599141 -0.550384 -0.384021 0.443371 -0.485896 0.381589 1.372465 -0.379236 0.161857 0.114230 0.292619 0.234778 0.249150 0.292017 -0.519146 -0.660880 -0.956407 -0.657513 -1.016084 0.029782 0.016757 -0.010655 0.057777 0.381934 0.339351
charge: 0.567331 0.561357 0.118793 0.536117 0.528684 0.176795 0.163052 -0.064059 0.067551 0.066254 -0.239377 -0.142251 0.067453 0.057820 -0.003152 -0.259825 -0.069876 0.182902 0.185237 -0.690128 0.187538 -0.688904 -0.059718 0.185614 -0.009190 -0.265403 0.120017 -0.046459 -0.061987 0.120220 0.061825 0.031526 0.027175 0.032169 0.042668 0.064384 0.076512 0.075204 0.064152 0.098766 0.133214
qa: -0.2136 -0.2192 -0.6365 -0.6350 -0.6526 -1.0019 -0.9654 1.3774 -0.3509 1.0781 0.3308 2.0045 -0.2579 0.7547 1.3259 0.7150 0.5991 -0.5504 -0.3840 0.4434 -0.4859 0.3816 1.3725 -0.3792 0.1619 0.1142 0.2926 0.2348 0.2492 0.2920 -0.5191 -0.6609 -0.9564 -0.6575 -1.0161 0.0298 0.0168 -0.0107 0.0578 0.3819 0.3394
va: 1.7937 1.7867 0.2620 2.8097 2.9656 1.3621 1.3827 0.9678 3.2534 -1.7391 2.9533 3.5862 3.4073 -2.4139 0.9160 -1.0330 -2.7230 2.7646 2.4897 3.1428 2.7823 3.2526 -7.3177 2.7589 2.9742 1.9636 0.7225 0.9883 0.9243 0.7212 0.5186 0.4460 -0.3812 0.4456 -0.2458 0.8651 0.8540 0.8651 0.8466 0.7293 0.7984
energy: 29729.8 29862.5 32026.1 33076.6 33572.0 33845.4 33899.7 35126.0 35716.4 36207.9 36646.1 37035.1 38170.8 38411.2 39390.4 40034.5 40507.9 40562.7 40768.8 41157.6 41700.4 42514.2 43185.3 44184.0 44333.7 44897.6 45141.4 45259.5 45468.4 45566.1 46815.4 46955.7 47190.2 47464.6 47522.6 47763.7 47817.4 47847.0 47883.5 48259.8 49169.7 49285.2 49302.0 49453.7 49762.3 50030.6 50360.2 50651.7 50996.5 51514.6 51778.1 51880.8 52124.9 52284.2 52427.1 52570.1 52673.3 52784.4 53100.5 53536.9 53555.2 53729.2 53982.3 54110.4 54227.8 54260.4 54317.5 54500.7 54759.6 54788.9 54855.0 54959.6 55229.3 55377.9 55711.4 56148.1 56238.8 56366.6 56534.1 56651.9 56682.6 56852.1 57021.7 57164.4 57177.8 57216.0 57285.0 57413.8 57559.0 57619.1 57683.4 57843.4 58048.7 58072.6 58284.3 58363.9 58378.1 58617.9 58669.6 58718.3 58745.5 58958.5 58988.5 59187.8 59459.8 59556.9 59627.6 59659.0 59683.9 59752.8 59832.7 59887.9 60054.2 60316.5 60345.5 60444.9 60778.3 60835.6 60892.5 60950.4 61056.3 61093.7 61172.0 61217.4 61256.1 61300.8 61364.6 61586.4 61613.7 61684.6 61702.7 61729.9 61822.4 61901.3 61979.2 62192.0 62229.1 62367.8 62389.6 62461.8 62513.6 62540.2 62634.5 62736.2 62794.2 62801.2 62869.5 62985.4 63086.0 63192.6 63262.2 63405.8 63491.8 63543.1 63566.8 63667.2 63814.8 63864.0 63993.7 64005.2 64087.9 64149.7 64254.9 64305.6 64437.4 64571.9 64640.9 64729.7 64788.2 64949.0 64986.9 65076.2 65081.4 65215.9 65241.9 65331.1 65430.5 65565.3 65621.4 65650.1 65698.1 65746.1 65785.5 65815.2 65887.3 65935.0 66010.0 66052.4 66123.8 66159.5 66233.6 66278.6 66312.5 66368.4 66479.4 66536.0 66643.9 66652.2 66725.4 66791.4
energy: -1954.154018010336
dipole: -0.52136 0.30966 -0.21170 -4.15766 1.82146 -2.33620 1.48617 -1.25309 0.23308
magnitude: 2.35732 au
magnitude: 5.99184 debye
