program: Orca
programVersion: 5.0.4
elementType: S S F N N O O C C C C C C C C C C N N C N C C N C C H H H H H H H H H H H H H H H
keywords: PBE0 ma-def2-TZVP AutoAux D4 VeryTightSCF TightOPT
charge: 2
multiplicity: 1
formula: C15H15FN6O2S2
InChI: InChI=1/C15H15FN6O2S2/c16-6-3-1-5(2-4-6)7(8-10(17)19-14(25)21-12(8)23)9-11(18)20-15(26)22-13(9)24/h1-4,7,19-22H,17-18H3
41 atoms
S  3.622306 -1.77274 -4.155686
S  -5.583842 0.500377 -1.394431
F  1.773771 0.613537 5.270532
N  0.341538 -3.878601 -1.02907
N  -1.046415 1.471633 0.442245
O  1.145728 0.83244 -0.851423
O  -2.197111 -2.987655 -0.84963
C  -0.216558 -1.43089 0.429919
C  2.19434 -0.116929 3.08442
C  1.703251 -0.603478 1.882497
C  1.305254 0.132287 4.107169
C  0.344351 -0.831081 1.707269
C  -0.048623 -0.103333 3.980253
C  -0.520273 -0.59451 2.774369
C  -1.529638 -0.860816 -0.04553
C  -2.451776 -1.800081 -0.64834
C  -1.923192 0.428976 -0.015488
N  -3.672662 -1.301091 -1.017512
N  -3.142247 0.83643 -0.433433
C  -4.085899 -0.008956 -0.930264
N  1.864463 -2.733964 -2.426519
C  2.54816 -1.659637 -2.911271
C  1.01237 -2.653684 -1.383719
N  2.248897 -0.493141 -2.280626
C  0.746189 -1.506397 -0.723753
C  1.362697 -0.311426 -1.251384
H  0.452138 -4.609102 -1.739843
H  -0.693642 -3.665463 -0.914182
H  -0.075122 1.276369 0.034551
H  -1.34886 2.400215 0.128556
H  -0.466773 -2.455695 0.713521
H  3.2529 0.065632 3.224897
H  2.410837 -0.815001 1.090186
H  -0.7177 0.085923 4.810905
H  -1.581119 -0.799042 2.673199
H  2.6992 0.342566 -2.638922
H  2.030413 -3.62608 -2.88255
H  -3.396479 1.817753 -0.369962
H  -4.329307 -1.959849 -1.42282
H  -0.9802 1.496442 1.468184
H  0.699994 -4.261135 -0.144213
totalener: -1954.43391793 hartree
nucrepener: 2737.38634772 hartree
electener: -4691.82026565 hartree
oneelecener: -8070.74454277 hartree
twoeener: 3378.92427712 hartree
cpcmener: -0.36481323 hartree
kineticenergy: 1949.00860271 hartree
exchangeener: -149.073221826541 hartree
correlationener: -7.090127365571 hartree
xcener: -156.163349192112 hartree
elementType: S F N O C H
chargesum: 2.0000000
charge: -0.462601 -0.469907 -0.254392 -0.391842 -0.358386 -0.437528 -0.478388 -1.276056 -0.286250 -0.123636 0.560825 -0.353327 -0.186261 -0.061667 1.052295 0.007359 0.035717 -0.156012 -0.155241 0.146425 -0.117367 0.175345 -0.044363 -0.163097 0.575551 0.497672 0.388745 0.357047 0.363644 0.388842 0.247459 0.198764 0.210509 0.200762 0.196070 0.334028 0.346690 0.345684 0.332802 0.403448 0.410639
charge: 0.241294 0.235125 0.087583 0.178475 0.170819 0.011833 -0.002984 -0.138090 -0.100268 -0.103704 -0.248461 -0.168579 -0.103410 -0.116809 -0.082615 -0.329206 -0.189708 0.159338 0.156484 -0.595199 0.158667 -0.594331 -0.179010 0.160010 -0.084130 -0.338158 0.272242 0.250134 0.248325 0.272455 0.251009 0.207089 0.215709 0.207170 0.216470 0.278619 0.280936 0.280729 0.277730 0.275643 0.280774
qa: -0.4626 -0.4699 -0.2544 -0.3918 -0.3584 -0.4375 -0.4784 -1.2761 -0.2862 -0.1236 0.5608 -0.3533 -0.1863 -0.0617 1.0523 0.0074 0.0357 -0.1560 -0.1552 0.1464 -0.1174 0.1753 -0.0444 -0.1631 0.5756 0.4977 0.3887 0.3570 0.3636 0.3888 0.2475 0.1988 0.2105 0.2008 0.1961 0.3340 0.3467 0.3457 0.3328 0.4034 0.4106
va: 1.7881 1.7833 0.9258 3.4226 3.4072 1.9412 1.9507 4.9481 4.2238 4.5347 3.4756 5.3063 4.2238 3.7628 2.4909 4.3000 4.3824 3.2716 3.2952 4.0949 3.2111 4.0316 4.3251 3.3401 2.0403 3.8085 0.8577 0.9311 0.9299 0.8560 0.8973 0.9522 0.9241 0.9486 0.9408 0.8965 0.8853 0.8880 0.8975 0.8289 0.8280
energy: -1954.576219602650
dipole: -0.52136 0.30431 -0.21705 -4.15766 1.83377 -2.32388 1.48617 -1.28807 0.19810
magnitude: 2.34239 au
magnitude: 5.95388 debye
