program: Orca
programVersion: 5.0.4
elementType: S S F N N O O C C C C C C C C C C N N C N C C N C C H H H H H H H H H
keywords: PBE0 ma-def2-TZVP AutoAux D4 VeryTightSCF TightOPT
charge: -4
multiplicity: 1
formula: C15H9FN6O2S2
InChI: InChI=1/C15H9FN6O2S2/c16-6-3-1-5(2-4-6)7(8-10(17)19-14(25)21-12(8)23)9-11(18)20-15(26)22-13(9)24/h1-4,7H,17-18H2
35 atoms
S  4.185762 -1.822142 -3.814361
S  -5.930617 0.259454 -0.611293
F  1.69776 0.396295 5.346096
N  0.285591 -3.668266 -1.354385
N  -1.148556 1.452013 0.011805
O  1.549204 0.861951 -0.578214
O  -2.343498 -3.150599 -0.232726
C  -0.202271 -1.346578 0.280645
C  2.144171 -0.442606 3.166718
C  1.675392 -0.826008 1.91654
C  1.238668 0.001079 4.106247
C  0.316758 -0.787378 1.596487
C  -0.108559 0.075987 3.833703
C  -0.556422 -0.31495 2.57575
C  -1.620059 -0.910243 -0.050152
C  -2.634169 -1.912103 -0.234821
C  -2.039985 0.408915 -0.154005
N  -3.933919 -1.521481 -0.402427
N  -3.319363 0.772255 -0.356634
C  -4.220749 -0.222032 -0.440809
N  2.024808 -2.668419 -2.486651
C  2.838639 -1.611552 -2.664463
C  1.062896 -2.532548 -1.559927
N  2.709909 -0.439695 -2.048425
C  0.852043 -1.376571 -0.81734
C  1.699052 -0.265744 -1.142199
H  0.359248 -4.275699 -2.155797
H  -0.676878 -3.511769 -1.025268
H  -0.158469 1.260448 -0.21195
H  -1.524093 2.303596 -0.374502
H  -0.359617 -2.404774 0.538421
H  3.204206 -0.463117 3.400933
H  2.370584 -1.154078 1.152368
H  -0.797201 0.450794 4.584901
H  -1.609925 -0.249934 2.326608
totalener: -1950.78053007 hartree
nucrepener: 2549.51194902 hartree
electener: -4500.29247909 hartree
oneelecener: -7838.91410590 hartree
twoeener: 3338.62162681 hartree
kineticenergy: 1945.86628128 hartree
exchangeener: -148.372401266553 hartree
correlationener: -7.049574525183 hartree
xcener: -155.421975791736 hartree
chargesum: -4.0000000
charge: -1.170430 -1.168568 -0.317813 -0.439886 -0.354565 -0.617554 -0.716016 -0.144449 -0.591907 0.400324 0.721237 -1.040838 -0.550472 0.682142 0.173099 0.284574 -0.170948 -0.505635 -0.514989 0.306766 -0.551523 0.348285 -0.146743 -0.430459 0.552078 0.329709 0.194638 0.301831 0.302015 0.190668 0.136321 0.079513 0.171381 0.078667 0.179549
charge: -0.305728 -0.308417 -0.010757 -0.156102 -0.129326 -0.175461 -0.210053 -0.171693 -0.175317 -0.096761 -0.270904 -0.122492 -0.177016 -0.104400 -0.171771 -0.440494 -0.362358 -0.028122 -0.053127 -0.651051 -0.054287 -0.650935 -0.350207 -0.024051 -0.168306 -0.449774 0.185891 0.210089 0.218094 0.187204 0.242795 0.175138 0.212487 0.174891 0.212323
qa: -1.1704 -1.1686 -0.3178 -0.4399 -0.3546 -0.6176 -0.7160 -0.1444 -0.5919 0.4003 0.7212 -1.0408 -0.5505 0.6821 0.1731 0.2846 -0.1709 -0.5056 -0.5150 0.3068 -0.5515 0.3483 -0.1467 -0.4305 0.5521 0.3297 0.1946 0.3018 0.3020 0.1907 0.1363 0.0795 0.1714 0.0787 0.1795
va: 0.5451 0.5432 0.7469 2.5843 2.3807 1.5498 1.5460 2.9152 4.6018 3.2779 2.9965 6.3102 4.5079 2.3810 3.1919 3.9702 4.6020 2.5577 2.4502 3.8825 2.5202 3.7703 4.3493 2.5551 2.1843 4.0369 0.9884 0.9590 0.9719 0.9905 0.9906 0.9738 0.9425 0.9734 0.9437
energy: -1950.937318626205
dipole: 0.70775 1.84672 2.55447 -1.79248 2.21140 0.41892 3.10245 4.33991 7.44236
magnitude: 7.87970 au
magnitude: 20.02859 debye
